program: Gaussian 09
title: 000257946
version: EM64L-G09RevD.01
frameworkgroup: C1[X(C9H9ClO)]
method: RPBEPBE
basis: SDD
operation: Freq
keyword: #p
keyword: freq=noraman
keyword: PBEPBE/SDD
title: #p freq=noraman PBEPBE/SDD
converged: YES YES NO NO
title: Mulliken charges:
elementType: Cl O C C C C C C C C C H H H H H H H H H
charge: -0.066919 -0.283052 0.365443 -0.331798 -0.362010 -0.318236 -0.204828 -0.183856 -0.117518 -0.108780 -0.548739 0.250371 0.256549 0.226918 0.226927 0.252459 0.256381 0.249597 0.226273 0.214818
chargesum: 0.00000
title: Mulliken charges with hydrogens summed into heavy atoms:
elementType: Cl O C C C C C C C C C
charge: -0.066919 -0.283052 0.365443 -0.081427 -0.105461 0.135609 0.047631 0.072525 -0.117518 0.140817 -0.107648
polarizability: 1.80364555e+02 4.50003935e+00 1.00033009e+02 -6.05177145e-02 -4.94435640e-02 4.64829830e+01
1716.lowfreq: -97.9875 -11.9385 -4.5011 0.0021 0.0028 0.0031 5.8111 41.6989 90.9953
frequency: -97.9645 41.6172 90.9953 120.7381 132.6405 233.3884 262.7104 316.7129 333.6167 415.4962 430.1016 490.5482 498.4639 557.7578 622.3340 641.8726 695.5410 797.2145 799.0561 822.6873 907.2671 924.5114 936.9067 951.6729 984.9378 990.0776 996.4328 1015.2911 1070.9345 1108.6671 1138.2683 1174.1095 1189.6492 1224.0487 1276.6353 1289.2351 1332.9738 1372.5868 1404.6557 1429.0897 1461.2629 1478.7230 1584.2094 1605.1952 1663.1229 2940.0948 2994.6240 3093.5306 3132.1221 3156.1402 3158.6234 3174.8863 3179.2392 3204.5954
redmass: 1.9539 5.5746 4.7556 2.0772 7.2463 5.2939 7.1733 6.8808 3.5759 3.0029 7.4318 3.6103 2.6874 1.3842 7.0029 7.9944 3.4516 6.2459 1.3036 1.5452 1.8908 1.3360 1.3194 1.3411 1.0886 3.9414 4.7964 1.6188 2.6051 1.3091 2.0939 1.1708 1.0605 3.8462 1.2895 1.2649 1.3241 5.3191 3.8548 1.2094 1.2995 1.7589 7.4081 6.6553 4.9455 1.0550 1.1058 1.0617 1.0940 1.0879 1.0885 1.0966 1.0978 1.1137
irintensity: 3.2341 0.0401 0.2738 2.1688 4.1569 0.4900 2.0618 3.3317 0.6799 0.0012 4.3978 0.4900 20.7888 23.2614 0.0584 45.1535 0.4529 0.6079 14.7940 74.0945 5.1834 2.2172 72.0847 0.0018 27.7042 29.2579 61.0518 7.4146 41.5684 13.5746 10.7229 44.4977 0.7314 244.7447 6.3696 0.9838 11.7604 10.6960 1.0868 23.7213 146.8420 84.5534 11.9758 18.2370 9.7186 24.8697 35.5866 8.7779 2.7024 8.9740 1.6667 8.9199 1.0695 21.6246
temp: 298.150 k
press: 1.00000 atm
elementType: 17 8 6 6 6 6 6 6 6 6 6 1 1 1 1 1 1 1 1 1
symmnumber: 1
zpe: 399838.7 jmol-1
zpe.correction: 0.152291 hartree
zpe.thermalcorrener: 0.162247 hartree
zpe.thermalcorrenthalpy: 0.163191 hartree
zpe.thermalcorrgfe: 0.115747 hartree
zpe.sumelectzpe: -882.796970 hartree
zpe.sumelectthermal: -882.787013 hartree
zpe.sumelectthermalent: -882.786069 hartree
zpe.sumelectthermalfe: -882.833513 hartree
dipole: -2.7384 -1.0524 -0.0030
dipole: 2.9336
quadrupole: -73.5097 -63.7187 -76.4724
quadrupole: 4.9142 0.0205 -0.0283
quadrupole: -2.2761 7.5149 -5.2388 4.9142 0.0205 -0.0283
hfenergy: -882.9492602 hartree
pointgroup: C01 [X(C9H9Cl1O1)]
dipole: -1.0771249 0.3989405 0.1130163 debye
dipolederiv: -0.8658554 -0.0907425 0.0552404 -0.1214244 -0.1467248 0.0045133 0.0528161 0.0021006 -0.0770079 -1.9372805 0.0910716 0.1362733 -0.0202581 -0.2996031 0.0007758 0.1287429 -0.00865 -0.3002372 1.6428607 0.0490506 -0.1177501 0.3726197 0.0179898 -0.0357811 -0.0951207 -0.009711 0.1130437 -0.2785826 0.0470053 0.0089432 -0.3035545 -0.0304349 0.0357202 -0.0147247 0.0080293 -0.2061367 -0.3324249 -0.0362836 0.0101726 0.1558126 0.0575015 0.0034974 0.0231142 0.0184803 -0.1782405 0.8088945 -0.16265 -0.0394007 -0.633623 0.3126489 0.0415337 -0.0722833 0.0044625 0.4520802 -0.1432832 -0.099858 -0.003028 0.0136336 0.0637875 0.0093506 0.0043092 0.0181361 -0.0942212 -0.1356527 0.0012456 0.0027629 -0.0361187 0.0782139 0.0144691 0.0000653 0.0116249 -0.0992477 1.1273769 0.1861993 -0.0817794 0.1704177 -0.0152784 -0.0076912 -0.0824936 -0.0088603 -0.0909692 0.2566493 0.0192553 -0.036279 0.1684808 0.0899616 0.0059082 -0.0265814 0.0176813 -0.2052731 -0.2362197 0.0707906 -0.0108459 0.069736 0.0924185 0.0275321 -0.0103316 0.0275466 -0.4196846 0.0005668 0.0897126 0.0191828 0.1107454 0.0036209 -0.0198149 0.0207005 -0.0181531 0.1692119 0.0642771 -0.0671715 0.0039231 -0.057819 -0.0201866 -0.0083189 0.0046879 -0.00751 0.17219 -0.0800445 -0.0293954 -0.0438513 0.0983734 -0.0170969 -0.0994145 -0.0185415 -0.0919057 -0.0712074 -0.0686405 -0.0188682 0.041521 0.1101489 -0.042977 0.0876323 0.0344989 0.100551 -0.0568038 0.0653843 -0.0530216 0.0042064 -0.0576444 -0.0249081 -0.0079909 0.0038413 -0.0084347 0.1635792 0.028283 0.0799386 0.0159263 0.07039 0.0179878 -0.0152127 0.0151554 -0.0159831 0.1632716 0.078761 0.0216801 0.0100507 -0.0423351 -0.0585822 -0.0122043 0.0054725 -0.0173246 0.182483 -0.095806 -0.0689425 0.0192265 -0.0760693 0.0391633 -0.0039171 0.0187755 -0.0045274 0.1940554 0.1007364 -0.0290161 0.0055052 0.0084886 -0.1175016 -0.0205869 0.0078972 -0.0175528 0.1891143 unknown
polarizability: 179.6134458|-3.1564362|99.6972198|-10.6618451|3.7723216|47.5698805 unknown
InChI: InChI=1S/C9H9ClO/c1-2-7-11-9-5-3-8(10)4-6-9/h2-6H,1,7H2
charge 0 multiplicity 1
20 atoms
Cl 4.553581 0.426583 -0.318021
O  -1.364423 -0.669204 0.067554
C  -0.007927 -0.326454 -0.015939
C  0.492335 0.999358 0.032788
C  0.885087 -1.419023 -0.157743
C  -2.338738 0.425851 0.22163
C  1.885833 1.226025 -0.060194
C  2.271355 -1.193415 -0.249954
C  2.755223 0.131205 -0.199558
C  -3.705166 -0.220516 0.290642
C  -4.871296 0.454387 0.428995
H  -0.17516 1.858598 0.141525
H  0.477505 -2.433447 -0.193453
H  -2.112492 0.997107 1.146641
H  -2.260646 1.117958 -0.643249
H  2.280111 2.245677 -0.023402
H  2.963328 -2.033371 -0.358935
H  -3.694487 -1.315579 0.219055
H  -5.827759 -0.075872 0.472602
H  -4.91156 1.548532 0.502918
