program: Gaussian 09
title: 000257944
version: EM64L-G09RevD.01
frameworkgroup: C1[X(C9H9BrO)]
method: RPBEPBE
basis: SDD
operation: Freq
keyword: #p
keyword: freq=noraman
keyword: PBEPBE/SDD
title: #p freq=noraman PBEPBE/SDD
converged: NO YES NO NO
title: Mulliken charges:
elementType: Br O C C C C C C C C C H H H H H H H H H
charge: -0.000911 -0.282841 0.365011 -0.337737 -0.365883 -0.318286 -0.172476 -0.152287 -0.231817 -0.108312 -0.548167 0.251377 0.257750 0.227291 0.227391 0.247471 0.251587 0.249923 0.226318 0.214599
chargesum: 0.00000
title: Mulliken charges with hydrogens summed into heavy atoms:
elementType: Br O C C C C C C C C C
charge: -0.000911 -0.282841 0.365011 -0.086360 -0.108133 0.136395 0.074995 0.099300 -0.231817 0.141611 -0.107250
polarizability: 1.99574692e+02 4.58573637e+00 1.01692083e+02 -3.37988047e-02 -3.30842789e-02 4.73071956e+01
1716.lowfreq: -96.5902 -4.8516 -3.6257 -0.0006 -0.0003 0.0004 13.2556 38.2628 84.8748
frequency: -96.5661 38.0751 84.8681 116.8100 126.0266 209.5960 219.2272 306.4023 322.8968 383.8808 413.3101 489.2353 501.4552 558.2668 619.9449 623.9100 697.3997 794.8251 801.2435 824.7411 907.4549 930.0640 939.0102 957.0021 985.5797 986.2890 994.1509 1015.3380 1058.8054 1111.2503 1138.1626 1177.4210 1190.1840 1225.6619 1276.8573 1289.9673 1333.4247 1367.8055 1402.7125 1430.2012 1459.7298 1475.9519 1578.4637 1601.9760 1664.6632 2942.2251 2997.6892 3091.0621 3131.6344 3156.3038 3158.0264 3175.1587 3179.1856 3201.3780
redmass: 1.9629 5.3013 4.9010 3.8833 2.6846 5.1192 9.3440 6.7627 3.4772 5.7921 2.9871 3.5375 2.7036 1.3826 7.1369 7.8453 3.4467 6.2481 1.3061 1.5382 1.9058 1.3364 1.3196 1.3436 1.0891 4.5641 4.7557 1.6167 2.4530 1.3291 2.0919 1.1831 1.0601 3.5515 1.2895 1.2616 1.3311 4.9329 3.8585 1.2086 1.3788 1.6187 7.3588 6.5296 4.9232 1.0549 1.1060 1.0621 1.0940 1.0878 1.0884 1.0964 1.0976 1.1135
irintensity: 3.2522 0.0625 0.2557 0.0090 5.5234 0.0443 1.7763 4.7051 0.4466 2.4714 0.0025 0.7576 22.1144 23.4399 12.1901 27.9816 0.1750 0.4851 15.4324 70.8472 5.4229 3.2566 70.1681 0.0142 28.2693 40.9778 62.1259 7.4448 29.6112 11.1929 11.5258 59.3286 0.7170 267.8076 7.3705 1.2335 10.0203 13.1550 1.3642 24.1033 171.1215 62.5325 12.9809 22.3977 9.9511 24.6114 34.9025 8.8966 2.5219 9.0346 1.3163 11.4771 1.1844 21.9224
temp: 298.150 k
press: 1.00000 atm
elementType: 35 8 6 6 6 6 6 6 6 6 6 1 1 1 1 1 1 1 1 1
symmnumber: 1
zpe: 398732.7 jmol-1
zpe.correction: 0.151869 hartree
zpe.thermalcorrener: 0.162041 hartree
zpe.thermalcorrenthalpy: 0.162985 hartree
zpe.thermalcorrgfe: 0.114268 hartree
zpe.sumelectzpe: -436.196404 hartree
zpe.sumelectthermal: -436.186232 hartree
zpe.sumelectthermalent: -436.185288 hartree
zpe.sumelectthermalfe: -436.234004 hartree
dipole: -2.7361 -1.1289 -0.0022
dipole: 2.9599
quadrupole: -71.0417 -66.3685 -79.4449
quadrupole: 5.2465 0.0074 -0.0145
quadrupole: 1.2433 5.9166 -7.1599 5.2465 0.0074 -0.0145
hfenergy: -436.3482729 hartree
pointgroup: C01 [X(C9H9Br1O1)]
dipole: -1.0847727 0.4082769 0.1124551 debye
dipolederiv: -0.7387807 -0.0812731 0.0499066 -0.107628 -0.087942 0.0057559 0.0482787 0.0036868 -0.047235 -2.0064368 0.0894703 0.1416358 -0.0214524 -0.2986687 0.0010442 0.1354392 -0.0080368 -0.3012197 1.70283 0.0467094 -0.1227766 0.3803417 0.0371774 -0.035159 -0.1018139 -0.0085119 0.1223742 -0.3061507 0.032586 0.0098114 -0.2923803 -0.0421402 0.0335227 -0.0106248 0.0079179 -0.2063553 -0.3529985 -0.0214153 0.0125982 0.1403747 0.0410031 0.0026823 0.0226174 0.0154304 -0.1797933 0.8288224 -0.1613538 -0.0402484 -0.6528419 0.3104462 0.0437481 -0.0716715 0.0048846 0.4506097 -0.199375 -0.0690147 0.0050468 -0.0377013 0.0856998 0.0135331 0.0070761 0.0160249 -0.0822805 -0.1930324 -0.0538823 0.0050817 -0.0047968 0.0978298 0.0118656 0.0081766 0.0157547 -0.0876357 1.1742558 0.2036777 -0.0922576 0.1847593 -0.0955573 -0.0110626 -0.093591 -0.0125847 -0.1461188 0.2598486 0.0191687 -0.0362651 0.1706736 0.0896517 0.0042723 -0.027152 0.0162163 -0.2054969 -0.2392485 0.070612 -0.0105069 0.0689674 0.0928898 0.0250735 -0.0102167 0.0250236 -0.4190523 -0.0109774 0.0878647 0.0200424 0.1082547 0.0026606 -0.0192512 0.0212929 -0.0177745 0.1706954 0.0522345 -0.0685063 0.0053514 -0.0580707 -0.0185442 -0.0074443 0.0059479 -0.0065902 0.1736725 -0.0816608 -0.0291618 -0.0434414 0.1021145 -0.0171257 -0.0992131 -0.0194522 -0.0917312 -0.0691727 -0.0702716 -0.0184675 0.0419698 0.1139023 -0.0406333 0.0863455 0.0349542 0.0998565 -0.0569681 0.0679926 -0.0544808 0.0038601 -0.0616693 -0.0321939 -0.0071287 0.003386 -0.0077345 0.159177 0.0293921 0.0835365 0.0155869 0.076466 0.0117943 -0.0153087 0.0151546 -0.0158811 0.1591625 0.0800702 0.0219507 0.0097254 -0.0422345 -0.0579418 -0.0110161 0.0055413 -0.0161401 0.1827344 -0.0979912 -0.0690305 0.01944 -0.0756771 0.0394569 -0.0032205 0.0189784 -0.0037823 0.1939085 0.1014773 -0.0289896 0.0054394 0.0085983 -0.1178626 -0.019039 0.0076789 -0.0160284 0.1889943 unknown
polarizability: 198.8072431|-1.1444547|101.2930726|-12.061317|3.4277221|48.473655 unknown
InChI: InChI=1S/C9H9BrO/c1-2-7-11-9-5-3-8(10)4-6-9/h2-6H,1,7H2
charge 0 multiplicity 1
20 atoms
Br 4.684734 0.4257 -0.335832
O  -1.379533 -0.66286 0.075106
C  -0.022983 -0.326036 -0.011297
C  0.485361 0.996859 0.031142
C  0.86545 -1.422736 -0.149466
C  -2.353073 0.435453 0.22222
C  1.87989 1.21644 -0.065134
C  2.252182 -1.204269 -0.244995
C  2.74814 0.118473 -0.201868
C  -3.719335 -0.211269 0.293152
C  -4.884713 0.465095 0.426861
H  -0.17641 1.860793 0.137671
H  0.453096 -2.43558 -0.180065
H  -2.127051 1.010539 1.144673
H  -2.273384 1.12161 -0.647011
H  2.273403 2.236479 -0.032391
H  2.935573 -2.051447 -0.351353
H  -3.707934 -1.306712 0.226911
H  -5.842852 -0.062503 0.472316
H  -4.925059 1.559973 0.495261
