program: Gaussian 09
title: 000257977
version: EM64L-G09RevD.01
frameworkgroup: C1[X(C14H14N2O4S)]
method: RPBEPBE
basis: SDD
operation: Freq
keyword: #p
keyword: freq=noraman
keyword: PBEPBE/SDD
title: #p freq=noraman PBEPBE/SDD
converged: YES YES NO NO
title: Mulliken charges:
elementType: S O O O O N N C C C C C C C C C C C C C C H H H H H H H H H H H H H H
charge: 0.959488 -0.505142 -0.515045 -0.221491 -0.219409 -0.338566 0.018341 -0.077456 0.402603 -0.677571 -0.236666 -0.208312 -0.314351 -0.323776 0.453661 -0.398220 -0.338450 -0.374065 -0.374019 0.391473 -0.795550 0.262280 0.217550 0.292200 0.282193 0.282305 0.251037 0.316547 0.248824 0.249952 0.285766 0.289220 0.242195 0.230289 0.242162
chargesum: 0.00000
title: Mulliken charges with hydrogens summed into heavy atoms:
elementType: S O O O O N N C C C C C C C C C C C C C C
charge: 0.959488 -0.505142 -0.515045 -0.221491 -0.219409 -0.338566 0.018341 -0.077456 0.402603 0.094459 0.045527 0.073993 -0.063314 -0.007229 0.453661 -0.149396 -0.088497 -0.088299 -0.084799 0.391473 -0.080905
polarizability: 2.90890770e+02 -3.69853437e+01 2.16023467e+02 1.54504042e+01 -5.64780941e+00 1.84841551e+02
1716.lowfreq: -21.8013 -8.7877 -5.6771 0.0010 0.0018 0.0026 4.1380 12.0037 16.2691
frequency: -21.5031 9.1256 16.2218 44.2968 56.1295 68.7897 85.2630 114.4048 124.3169 132.7853 170.4066 184.2422 217.9286 226.5049 245.3958 263.3314 281.7432 290.2749 304.1254 328.0732 367.6684 397.1591 403.0218 408.7101 418.4304 429.4721 475.6685 502.9712 506.2357 528.6255 581.2645 611.2990 620.4535 628.9671 665.6020 704.1462 735.8382 743.9843 776.4690 803.2067 813.4535 824.9280 827.9785 845.9461 863.6564 954.8708 961.6482 980.8722 982.0181 986.0803 994.8973 995.5468 1002.7251 1031.1386 1047.4234 1050.2848 1082.3121 1097.6091 1111.4840 1122.7421 1150.0508 1184.6273 1187.9116 1219.5352 1228.0567 1292.1450 1299.1683 1305.7929 1349.8937 1379.3874 1385.7766 1391.8712 1402.2953 1421.4620 1438.6721 1461.4063 1469.1742 1470.8378 1475.1975 1479.2267 1486.3190 1572.2121 1590.2623 1592.5054 1603.1244 2938.3608 2985.0545 3048.3019 3064.4423 3092.1397 3095.4196 3139.5920 3141.3384 3163.3672 3163.8230 3165.0173 3173.5042 3182.4383 3185.2682
redmass: 1.0571 4.2367 6.2500 4.7187 5.8426 6.4296 4.7729 5.5793 5.5579 5.2522 8.9928 6.2692 7.6698 8.2598 1.5460 3.0574 4.0595 3.7994 5.1640 4.8621 3.6368 7.6791 5.5953 2.8960 3.0832 9.5053 4.4050 4.3584 3.3206 4.7128 6.0491 6.4903 6.9613 6.9460 4.7477 3.3359 4.8853 6.8613 4.9778 7.0312 12.3719 1.3340 1.3535 1.2537 1.5256 10.6076 1.2996 1.3620 1.4343 2.6064 2.8323 2.0759 1.3554 6.0083 2.4542 1.5907 1.3286 2.8756 1.3683 1.2969 1.3889 1.6335 1.1409 3.0367 3.3575 3.4843 1.2638 1.3996 7.1690 4.3050 7.7882 3.1865 1.2985 1.1560 3.9668 1.0630 1.0449 2.3019 1.1123 2.3805 1.0646 7.7566 6.7438 5.9214 6.1375 1.0428 1.0376 1.0905 1.0974 1.0988 1.0991 1.0898 1.0892 1.0963 1.0900 1.0877 1.0955 1.0958 1.0970
irintensity: 0.4909 0.9835 2.4167 0.2631 2.9571 0.4933 2.5766 1.9220 3.5670 0.1151 7.0918 7.2934 0.2386 8.9457 4.0449 1.9655 2.1034 8.8557 0.4674 4.5652 0.5898 44.2318 14.3789 0.4299 7.6952 69.8056 17.1308 4.7620 135.4115 1.4537 21.1736 35.6864 0.5233 13.1866 27.2501 2.0925 3.2358 3.5636 3.6929 34.8065 162.9088 22.4897 14.8865 1.3148 53.6954 51.3945 1.4721 5.1429 0.8014 3.3637 0.5781 6.0503 0.5852 23.7030 23.7866 13.7022 67.2423 13.4430 18.2112 9.1462 13.5678 276.7199 9.4511 11.7485 423.1454 51.6614 3.0439 5.7292 73.0666 3.9921 40.6648 10.9871 16.7799 16.6578 20.4314 61.0060 15.0992 21.5477 16.0492 45.7776 12.5885 6.5801 4.6155 12.4347 171.9034 42.5533 17.9669 17.1559 12.4967 1.1249 16.3110 8.1344 6.5366 4.3098 1.3104 2.9131 3.3924 0.5466 3.2924
temp: 298.150 k
press: 1.00000 atm
elementType: 16 8 8 8 8 7 7 6 6 6 6 6 6 6 6 6 6 6 6 6 6 1 1 1 1 1 1 1 1 1 1 1 1 1 1
symmnumber: 1
zpe: 672451.7 jmol-1
zpe.correction: 0.256123 hartree
zpe.thermalcorrener: 0.275983 hartree
zpe.thermalcorrenthalpy: 0.276927 hartree
zpe.thermalcorrgfe: 0.204798 hartree
zpe.sumelectzpe: -1348.572934 hartree
zpe.sumelectthermal: -1348.553074 hartree
zpe.sumelectthermalent: -1348.552130 hartree
zpe.sumelectthermalfe: -1348.624259 hartree
dipole: 5.3563 2.9450 4.0704
dipole: 7.3437
quadrupole: -163.8999 -127.8687 -125.4707
quadrupole: 28.2747 6.3071 -9.2650
quadrupole: -24.8201 11.2111 13.6091 28.2747 6.3071 -9.2650
hfenergy: -1348.8290571 hartree
pointgroup: C01 [X(C14H14N2O4S1)]
dipole: 2.2170935 -1.1922818 -1.4179724 debye
polarizability: 287.6675596|39.550183|218.7671519|-15.7438492|-8.5810743|185.3210766 unknown
InChI: InChI=1S/C14H14N2O4S/c1-11-3-9-14(10-4-11)21(19,20)15(2)12-5-7-13(8-6-12)16(17)18/h3-10H,1-2H3
charge 0 multiplicity 1
35 atoms
S  1.770552 1.970645 0.491244
O  1.23535 2.266469 1.991836
O  2.954447 2.852752 -0.187513
O  -4.867427 -1.651507 -0.977296
O  -4.742786 -1.271842 1.272146
N  0.239186 2.230721 -0.740553
N  -4.316701 -1.105793 0.060592
C  2.238318 0.150021 0.368273
C  -0.858464 1.36967 -0.547032
C  0.731166 2.549351 -2.089885
C  3.158705 -0.223804 -0.624376
C  1.662293 -0.755101 1.276836
C  -1.497517 0.724153 -1.653657
C  -1.405349 1.192736 0.76602
C  2.94237 -2.551812 0.168033
C  3.504812 -1.590748 -0.713188
C  2.025457 -2.113151 1.162229
C  -2.634726 -0.073974 -1.456457
C  -2.527055 0.378453 0.964445
C  -3.135409 -0.253345 -0.147909
C  3.318027 -4.017734 0.066297
H  -0.052344 3.12863 -2.610657
H  0.996388 1.660576 -2.701105
H  1.621463 3.192332 -1.989627
H  3.612069 0.527313 -1.279239
H  0.977446 -0.408976 2.056492
H  -1.110657 0.855707 -2.667407
H  -0.950562 1.722508 1.607649
H  4.22659 -1.910916 -1.472627
H  1.593407 -2.841206 1.858152
H  -3.135316 -0.570604 -2.292133
H  -2.958163 0.239202 1.959341
H  2.426174 -4.645481 -0.115703
H  4.033245 -4.200337 -0.752767
H  3.779411 -4.376212 1.005147
