program: Gaussian 09
title: 000257978
version: EM64L-G09RevD.01
frameworkgroup: C1[X(C14H14N2O4S)]
method: RPBEPBE
basis: SDD
operation: Freq
keyword: #p
keyword: freq=noraman
keyword: PBEPBE/SDD
title: #p freq=noraman PBEPBE/SDD
converged: YES YES NO NO
title: Mulliken charges:
elementType: S O O O O N N C C C C C C C C C C C C C C H H H H H H H H H H H H H H
charge: 0.968839 -0.508541 -0.501987 -0.200423 -0.173667 -0.305457 0.023170 -0.092215 0.274643 -0.671672 0.312123 -0.227357 -0.239327 -0.285616 0.447046 -0.366279 -0.375667 -0.351932 -0.244176 -0.224957 -0.796998 0.211131 0.266532 0.278229 0.289135 0.288133 0.240740 0.247301 0.247042 0.283315 0.236409 0.243278 0.230644 0.230709 0.247851
chargesum: 0.00000
title: Mulliken charges with hydrogens summed into heavy atoms:
elementType: S O O O O N N C C C C C C C C C C C C C C
charge: 0.968839 -0.508541 -0.501987 -0.200423 -0.173667 -0.305457 0.023170 -0.092215 0.274643 0.084220 0.312123 0.061778 0.048805 -0.044876 0.447046 -0.118978 -0.128624 -0.068617 -0.007767 0.018322 -0.087794
polarizability: 2.59543649e+02 8.88773559e+00 2.27041316e+02 -2.18024379e+01 -1.27568432e+01 1.61481036e+02
1716.lowfreq: -8.0668 -4.8253 -0.0003 0.0007 0.0013 5.5470 17.8269 29.3211 33.3299
frequency: 16.8932 29.2971 33.2093 42.8766 50.4922 71.9892 83.6268 113.2764 122.8085 134.0728 142.2677 197.0995 208.8744 226.1034 231.8773 266.5431 270.0357 283.1505 314.0830 318.1444 364.7520 368.4402 388.6211 405.0646 409.1073 426.9677 439.2826 504.1950 532.1158 555.2166 577.8124 585.4117 620.9936 635.8823 665.1258 706.6315 738.2482 753.9790 771.7241 775.5751 804.5463 812.2982 827.7688 851.3852 870.9216 959.7780 960.8968 964.4746 983.5591 989.9118 991.3102 991.5085 1019.0397 1039.8041 1046.6501 1048.9800 1072.8196 1087.5224 1119.1441 1128.4864 1151.1592 1176.1923 1184.6761 1209.8857 1217.3980 1262.0853 1278.4893 1296.5371 1373.6707 1380.3050 1380.9150 1390.8596 1399.2737 1420.4212 1433.6008 1454.0660 1465.6545 1470.5846 1471.1142 1474.3674 1491.4261 1566.9344 1591.4708 1592.5313 1595.4029 2927.4959 2981.6267 3050.8102 3064.4768 3093.6700 3098.9446 3136.2461 3137.7566 3139.1761 3157.8037 3160.5730 3164.3794 3168.3137 3182.6531
redmass: 5.5739 1.0214 5.4777 4.4389 7.1805 7.0411 6.4385 4.6155 3.9520 5.9922 6.2101 9.4721 8.4920 2.0782 3.2538 2.4534 4.0566 4.5108 4.2067 4.7601 6.6322 4.7215 5.0714 5.7479 3.1167 8.9748 4.6589 3.2012 4.0877 5.2517 5.7416 5.0394 6.9587 6.4999 5.6098 3.3162 5.2344 5.4234 1.3624 4.8479 6.8049 12.4090 1.3702 1.2423 1.4559 2.9574 2.0968 1.3003 1.4118 1.3461 2.1003 2.5272 7.1306 2.9312 2.4323 1.6003 2.9751 1.3208 1.2900 1.5438 1.5625 1.0800 1.1389 10.8050 3.0418 1.5654 4.0491 1.2662 8.6629 5.8317 5.7960 3.0303 1.2179 1.1646 2.4775 1.0650 2.3752 1.1010 2.3194 1.0600 1.0749 6.2371 6.8277 5.9662 6.4247 1.0468 1.0390 1.0846 1.0948 1.1002 1.1004 1.0890 1.0893 1.0864 1.0902 1.0956 1.0968 1.0952 1.0982
irintensity: 0.2337 0.5772 0.6146 0.0644 0.7560 0.2627 2.6235 1.7418 3.6280 1.6047 1.6000 5.8693 3.3480 3.1307 3.4204 2.8186 1.2928 2.9816 0.9749 0.9981 3.3904 0.4703 2.3654 16.2665 2.4482 78.8121 15.2380 77.9929 22.7824 2.6366 12.8793 11.8975 0.3029 8.1864 28.8299 1.6215 1.7065 20.8213 59.2171 1.6987 9.6891 110.5721 21.3143 1.0974 0.7805 33.2723 22.8486 0.1412 1.6946 1.4573 4.1491 1.5204 8.1121 3.7420 25.4481 21.9919 8.9728 20.2584 8.6115 9.5069 1.6296 4.0119 12.5547 193.8369 5.7767 4.7354 19.7601 2.7734 31.5907 4.1636 60.3066 9.8973 16.9018 5.3412 17.5180 40.6836 69.7021 15.4702 23.3375 13.7949 15.1942 8.5959 0.3783 12.1523 8.2864 48.6936 21.7026 14.1295 16.1319 13.8517 0.5427 11.5358 6.3161 4.0286 10.1016 2.7179 7.6736 8.1135 8.8928
temp: 298.150 k
press: 1.00000 atm
elementType: 16 8 8 8 8 7 7 6 6 6 6 6 6 6 6 6 6 6 6 6 6 1 1 1 1 1 1 1 1 1 1 1 1 1 1
symmnumber: 1
zpe: 670779.8 jmol-1
zpe.correction: 0.255487 hartree
zpe.thermalcorrener: 0.276346 hartree
zpe.thermalcorrenthalpy: 0.277290 hartree
zpe.thermalcorrgfe: 0.203379 hartree
zpe.sumelectzpe: -1348.553807 hartree
zpe.sumelectthermal: -1348.532948 hartree
zpe.sumelectthermalent: -1348.532004 hartree
zpe.sumelectthermalfe: -1348.605915 hartree
dipole: -7.4971 8.0282 3.9667
dipole: 11.6788
quadrupole: -120.7436 -131.7318 -128.7859
quadrupole: 10.4613 4.2743 -6.2698
quadrupole: 6.3435 -4.6447 -1.6988 10.4613 4.2743 -6.2698
hfenergy: -1348.8092938 hartree
pointgroup: C01 [X(C14H14N2O4S1)]
dipole: -2.8319716 -3.2496806 -1.5910592 debye
polarizability: 258.0763072|-7.2223048|226.0984781|25.808808|-14.1455821|163.8912154 unknown
InChI: InChI=1S/C14H14N2O4S/c1-11-7-9-12(10-8-11)21(19,20)15(2)13-5-3-4-6-14(13)16(17)18/h3-10H,1-2H3
charge 0 multiplicity 1
35 atoms
S  -0.19267 1.715843 0.196518
O  -0.520162 3.195849 -0.380022
O  0.573846 1.428791 1.59671
O  3.639454 0.654506 1.978808
O  3.376744 1.760121 0.005491
N  0.926514 0.865668 -1.19527
N  3.182447 0.750432 0.775626
C  -1.809615 0.738855 0.222345
C  1.46287 -0.375261 -0.783738
C  0.232659 0.992056 -2.491706
C  2.479056 -0.448215 0.226074
C  -1.882808 -0.404048 1.036423
C  -2.879025 1.201938 -0.56219
C  1.023105 -1.610043 -1.350133
C  -4.212918 -0.698759 0.274671
C  -3.100076 -1.119569 1.051763
C  -4.084455 0.46686 -0.527535
C  2.966169 -1.689709 0.685929
C  1.548597 -2.845367 -0.928056
C  2.507244 -2.891919 0.111449
C  -5.525986 -1.456922 0.330636
H  -0.66234 0.344458 -2.620158
H  0.961206 0.757944 -3.287235
H  -0.068403 2.046707 -2.606831
H  -1.030682 -0.704411 1.654473
H  -2.778813 2.119315 -1.151493
H  0.256356 -1.591546 -2.130647
H  -3.18771 -2.012021 1.681845
H  -4.937847 0.808611 -1.124277
H  3.720474 -1.688074 1.4775
H  1.196465 -3.771701 -1.39455
H  2.904786 -3.850023 0.460027
H  -6.089966 -1.364055 -0.613446
H  -5.36816 -2.530107 0.534143
H  -6.171155 -1.061099 1.138659
