program: Gaussian 09
title: 000257915
version: EM64L-G09RevD.01
frameworkgroup: C1[X(C12H8Br2N2)]
method: RPBEPBE
basis: SDD
operation: Freq
keyword: #p
keyword: freq=noraman
keyword: PBEPBE/SDD
title: #p freq=noraman PBEPBE/SDD
converged: NO YES NO NO
title: Mulliken charges:
elementType: Br Br N N C C C C C C C C C C C C H H H H H H H H
charge: 0.008791 0.008791 -0.111719 -0.111719 0.190781 0.190780 -0.239560 -0.239560 -0.340179 -0.340179 -0.168778 -0.168778 -0.189008 -0.189008 -0.205265 -0.205265 0.295865 0.295865 0.259968 0.259968 0.241869 0.241869 0.257236 0.257236
chargesum: 0.00000
title: Mulliken charges with hydrogens summed into heavy atoms:
elementType: Br Br N N C C C C C C C C C C C C
charge: 0.008791 0.008791 -0.111719 -0.111719 0.190781 0.190780 0.056305 0.056305 -0.080211 -0.080211 -0.168778 -0.168778 0.052861 0.052861 0.051971 0.051971
polarizability: 3.82794813e+02 2.70568817e+01 2.09359388e+02 4.90365520e-03 -2.11053415e-03 6.03410009e+01
1716.lowfreq: -3.2625 -0.0002 0.0004 0.0008 5.5571 7.5769 11.3443 43.5384 60.0285
frequency: 11.3443 43.5384 60.0285 84.1835 125.5090 150.6912 164.6963 222.2597 255.5829 263.2885 289.4334 298.3682 299.9934 335.5565 436.1698 442.1900 516.8370 536.4668 540.1380 588.5111 632.8789 653.4325 677.4441 692.0597 694.2757 795.4886 801.1518 848.5375 914.2226 914.9920 915.7774 928.6645 936.8020 978.6524 979.1594 988.0277 988.0804 1051.0891 1051.1835 1083.2318 1089.4886 1138.4887 1163.2068 1176.7935 1202.6452 1271.4929 1281.7542 1362.2512 1374.3578 1380.3196 1412.2525 1417.2599 1443.9299 1448.4179 1558.1761 1560.7722 1592.3829 1592.8788 3148.8763 3148.9364 3169.2031 3169.2656 3177.6086 3177.8977 3181.4274 3181.5383
redmass: 10.8317 10.5530 5.0505 24.5930 5.7377 5.5723 5.1325 7.6267 7.8104 6.2357 10.5359 8.2552 5.0340 4.7705 3.0984 3.2341 7.2183 7.2019 5.3815 5.3257 7.1730 7.6182 2.2616 8.0629 2.0464 1.4035 1.4675 7.3705 1.3717 7.7701 1.3667 1.4385 1.5114 5.7876 5.5772 1.3510 1.3497 1.9459 2.0323 1.5895 1.4864 2.8263 1.2304 1.2362 2.3566 1.3319 1.4771 7.7226 6.3437 8.8327 3.4682 3.2749 2.2356 2.3761 6.3750 6.5642 7.2218 7.0742 1.0873 1.0873 1.0928 1.0929 1.0922 1.0923 1.0990 1.0989
irintensity: 0.3313 0.0176 1.6834 0.0000 0.0001 0.0000 0.1317 2.2392 0.0000 0.0004 11.3474 0.0000 0.5405 0.0001 0.0002 12.8270 29.4151 3.9839 0.0029 2.2850 0.0000 58.9377 0.0001 0.0270 74.2560 0.0004 84.4420 116.9660 8.0100 0.0005 0.0000 0.0001 28.7063 16.1278 0.0000 1.3200 0.0001 29.9479 0.0009 0.0000 19.9473 0.0001 54.0752 0.0000 155.2171 0.0000 1.0381 0.0000 2.1456 0.0000 40.2411 0.0000 0.0002 105.2731 123.9734 0.0003 0.0000 0.7532 13.8845 0.0084 4.8007 0.0045 5.1238 0.0050 28.4142 0.0000
temp: 298.150 k
press: 1.00000 atm
elementType: 35 35 7 7 6 6 6 6 6 6 6 6 6 6 6 6 1 1 1 1 1 1 1 1
symmnumber: 1
zpe: 436706.1 jmol-1
zpe.correction: 0.166333 hartree
zpe.thermalcorrener: 0.180441 hartree
zpe.thermalcorrenthalpy: 0.181386 hartree
zpe.thermalcorrgfe: 0.121177 hartree
zpe.sumelectzpe: -597.352623 hartree
zpe.sumelectthermal: -597.338514 hartree
zpe.sumelectthermalent: -597.337570 hartree
zpe.sumelectthermalfe: -597.397779 hartree
dipole: 0.0000 0.0000 0.0068
dipole: 0.0068
quadrupole: -112.6168 -93.6201 -116.4527
quadrupole: 16.1671 0.0001 0.0001
quadrupole: -5.0536 13.9431 -8.8895 16.1671 0.0001 0.0001
hfenergy: -597.5189558 hartree
pointgroup: C01 [X(C12H8Br2N2)]
dipole: 0.0000016 0.0026752 0.0000007 debye
dipolederiv: -0.3280879 -0.0002743 -0.2738397 -0.0005213 -0.0431897 -0.0007326 -0.5465414 -0.0006219 -0.6382087 -0.3280504 0.0006772 -0.273912 0.0010825 -0.0431946 0.0013333 -0.5466142 0.001459 -0.6384017 0.4066445 0.0001078 0.003539 -0.0019589 -0.0994123 -0.0001439 0.2703969 -0.0004638 -0.1606081 0.4061341 -0.0004579 0.0030341 0.0015284 -0.0994177 0.0003432 0.2703655 0.0003303 -0.1606176 -0.2278435 -0.0001236 -0.0447583 0.0007623 0.0291029 0.0001051 -0.1127276 0.0003052 0.1780763 -0.2281079 0.0003409 -0.0450816 -0.0005553 0.0291044 -0.000281 -0.1131701 -0.0003157 0.1776048 -0.2631394 -0.000147 -0.2677644 -0.0005136 -0.0512822 -0.0004577 -0.0814279 -0.0003581 -0.3372626 -0.262374 0.0005061 -0.2669441 0.0006484 -0.0512838 0.0007966 -0.081573 0.0006348 -0.3374986 -0.0418302 0.0000717 0.1058264 0.000254 -0.1352988 -0.0000373 -0.1676423 0.0001033 -0.0149785 -0.0416093 -0.0002226 0.1061079 -0.000175 -0.1352982 -0.0001117 -0.1678475 -0.0000911 -0.0151021 0.2711671 0.0006592 0.6292311 0.0015606 -0.1196788 0.0016393 1.1099811 0.0013441 1.1291908 0.2709556 -0.0014239 0.6291893 -0.0024181 -0.1196715 -0.0027431 1.1099715 -0.0030782 1.1292949 0.09287 -0.0002075 -0.0674479 -0.0008218 -0.1402164 0.0004019 -0.2475434 0.0004175 0.0437751 0.093022 0.0001251 -0.0673352 0.0007276 -0.1402161 -0.0006568 -0.2473813 -0.0003864 0.0439531 -0.1060386 -0.0001749 -0.1451825 -0.000543 -0.0875398 -0.0003863 -0.2727363 -0.0002298 -0.2934918 -0.1059854 0.0002937 -0.1451006 0.0005328 -0.0875403 0.0003676 -0.2727836 0.0005836 -0.2935162 0.1634272 0.0000928 0.0871849 0.0000484 0.1580551 -0.0000349 0.0426328 -0.0001384 0.0546251 0.1631237 -0.0001502 0.0868225 -0.0000554 0.1580551 0.0000908 0.043003 0.000176 0.0550743 0.0931144 -0.0000388 -0.0799668 0.0000839 0.1643456 -0.0001009 -0.0606967 -0.0001657 -0.016964 0.0932102 0.0001425 -0.079911 0.0000392 0.164345 0.0003208 -0.0605599 0.0003325 -0.0168837 -0.0113412 0.0002065 0.0693384 0.0003135 0.1615484 -0.0003549 0.0964329 -0.0003564 -0.0489056 -0.0115566 -0.000142 0.0691285 -0.0002211 0.1615486 0.0005372 0.0966083 0.0004543 -0.0487375 -0.0487565 0.000054 -0.0159673 0.0000874 0.163568 -0.0000213 -0.0300877 -0.0000788 0.1047776 -0.0489479 0.0000853 -0.0161907 0.0001146 0.1635673 0.0001265 -0.0300591 0.000144 0.1048046 unknown
polarizability: 375.944587|-0.1243482|60.3410754|43.2806077|-0.0790434|216.2095391 unknown
InChI: InChI=1S/C12H8Br2N2/c13-9-3-1-5-11(7-9)15-16-12-6-2-4-10(14)8-12/h1-8H
charge 0 multiplicity 1
24 atoms
Br -4.589031 0.297151 -2.912518
Br 4.588538 0.291855 2.912521
N  -0.374935 0.300162 0.535349
N  0.374443 0.300345 -0.535339
C  -1.785756 0.300566 0.28215
C  1.785264 0.299625 -0.28214
C  -2.365814 0.299252 -1.020274
C  2.365322 0.296915 1.020282
C  -2.610295 0.302148 1.43627
C  2.609804 0.301562 -1.43626
C  -3.761848 0.299278 -1.126312
C  3.761356 0.295931 1.126318
C  -4.013545 0.302604 1.295853
C  4.013054 0.300973 -1.295844
C  -4.604931 0.301091 0.011156
C  4.604439 0.298068 -0.011149
H  -1.708934 0.298489 -1.893931
H  1.708443 0.295903 1.893939
H  -2.130586 0.302878 2.419678
H  2.130095 0.303377 -2.419667
H  -4.655983 0.304335 2.182093
H  4.655492 0.302966 -2.182083
H  -5.692358 0.301382 -0.104186
H  5.691867 0.297546 0.104192
