program: Gaussian 09
title: 000257903
version: EM64L-G09RevD.01
frameworkgroup: C1[X(C14H10N2O5)]
method: RPBEPBE
basis: SDD
operation: Freq
keyword: #p
keyword: freq=noraman
keyword: PBEPBE/SDD
title: #p freq=noraman PBEPBE/SDD
converged: YES YES NO NO
title: Mulliken charges:
elementType: O O O O O N N C C C C C C C C C C C C C C H H H H H H H H H H
charge: -0.207870 -0.190048 -0.180238 -0.181629 -0.183702 0.020559 0.023639 0.378642 0.300646 0.020766 -0.509855 -0.515686 0.416842 0.416587 0.432818 -0.345694 -0.350063 -0.504836 -0.393847 -0.373171 -0.799193 0.331013 0.330466 0.256028 0.274478 0.340978 0.241452 0.240980 0.233068 0.231512 0.245357
chargesum: 0.00000
title: Mulliken charges with hydrogens summed into heavy atoms:
elementType: O O O O O N N C C C C C C C C C C C C C C
charge: -0.207870 -0.190048 -0.180238 -0.181629 -0.183702 0.020559 0.023639 0.378642 0.300646 0.020766 -0.178842 -0.185219 0.416842 0.416587 0.432818 -0.089666 -0.075586 -0.163858 -0.152395 -0.132192 -0.089255
polarizability: 2.97145507e+02 -1.16959538e+01 1.99166902e+02 9.57995011e+00 1.57517667e+01 1.01634829e+02
1716.lowfreq: -38.4616 -3.1631 -0.0005 0.0002 0.0005 0.6507 3.6034 24.0442 42.5570
frequency: -38.2639 23.9926 42.5519 47.8338 50.8164 63.5496 98.5907 121.0966 137.3609 149.6143 195.4831 210.6093 224.1451 270.0523 305.1967 330.1261 342.0943 348.3792 398.4004 407.4734 451.6335 463.8017 477.2451 500.1828 538.0790 585.8161 601.0531 634.6094 646.3124 683.0733 697.1869 708.1319 715.6535 724.2033 760.7209 774.3542 813.8809 842.2529 859.7019 867.9422 956.1058 969.4652 970.7482 974.8093 982.3773 988.1904 990.7852 994.6116 1013.8403 1046.3160 1073.1792 1107.1191 1128.8522 1170.0038 1195.4912 1206.2716 1219.0021 1227.0043 1242.9372 1287.5423 1311.6471 1370.0514 1378.5762 1383.8265 1394.1475 1397.6121 1413.9062 1434.0918 1458.4381 1466.0477 1471.7801 1501.7469 1536.8707 1572.9348 1589.7104 1612.3384 1618.6830 2979.0529 3061.5482 3093.3531 3129.9641 3132.3709 3152.7685 3162.0551 3179.6063 3181.7578 3192.5718
redmass: 1.0177 7.3975 5.8281 9.7117 13.1117 5.3543 6.0475 7.5364 12.4677 7.8369 4.9963 4.7812 5.6495 5.0694 8.4404 11.8824 3.4274 6.9856 6.2246 3.0273 4.9299 5.4957 3.6753 8.0950 5.8912 5.3435 5.8612 6.8626 4.9497 12.1958 2.9709 6.1437 5.1346 8.8905 2.9042 6.2458 6.9902 1.6130 1.3596 7.9252 2.2042 1.4974 1.4225 2.4665 1.5962 2.6211 1.6440 1.4882 2.6728 1.5997 1.3973 1.5721 1.3134 4.7527 1.2624 13.4153 7.3908 2.9281 1.2312 4.3876 1.3226 4.5732 9.6417 10.3589 5.7340 1.2188 3.6940 5.5558 3.8010 1.1179 1.0610 2.6351 9.2392 6.3466 7.9072 7.9802 6.4005 1.0394 1.0940 1.1001 1.0877 1.0891 1.0960 1.0962 1.0919 1.0928 1.0930
irintensity: 0.6739 0.4959 0.5023 0.0354 0.0132 0.6187 4.4989 6.5117 2.2592 2.8334 2.4463 1.7295 0.5826 1.2437 2.3571 0.6736 3.7493 2.0602 0.2278 0.3037 4.4572 0.6606 13.4075 7.0730 0.6398 0.5051 25.4507 0.5906 9.5144 42.6004 38.5903 18.8390 12.7197 0.6736 31.1440 7.2187 0.9902 27.1506 13.1407 8.7781 27.6803 21.2617 1.3459 26.2329 5.5406 1.8658 3.1281 11.7858 1.2688 21.4613 66.2339 72.2435 12.5457 7.1564 86.2275 308.5077 194.3007 1.1085 0.1053 203.5406 15.6297 4.8900 50.8532 147.1078 9.7030 17.3072 18.7403 14.6327 18.6562 14.3027 14.6213 1.8757 157.5455 9.3410 49.6606 43.5820 66.2356 17.8806 19.1712 14.0743 8.9490 17.0164 14.1200 4.3831 15.5938 2.1720 25.8765
temp: 298.150 k
press: 1.00000 atm
elementType: 8 8 8 8 8 7 7 6 6 6 6 6 6 6 6 6 6 6 6 6 6 1 1 1 1 1 1 1 1 1 1
symmnumber: 1
zpe: 568437.4 jmol-1
zpe.correction: 0.216506 hartree
zpe.thermalcorrener: 0.233990 hartree
zpe.thermalcorrenthalpy: 0.234934 hartree
zpe.thermalcorrgfe: 0.168752 hartree
zpe.sumelectzpe: -1023.476449 hartree
zpe.sumelectthermal: -1023.458965 hartree
zpe.sumelectthermalent: -1023.458021 hartree
zpe.sumelectthermalfe: -1023.524203 hartree
dipole: -6.8354 0.9695 0.9958
dipole: 6.9753
quadrupole: -116.7510 -146.8420 -117.5027
quadrupole: -0.5999 -4.2215 3.6675
quadrupole: 10.2809 -19.8101 9.5292 -0.5999 -4.2215 3.6675
hfenergy: -1023.6929554 hartree
pointgroup: C01 [X(C14H10N2O5)]
dipole: 2.5989574 0.4671168 -0.7472474 debye
polarizability: 291.7021576|27.2021552|166.5164958|-3.8928756|-51.9313518|139.7285852 unknown
InChI: InChI=1S/C14H10N2O5/c1-9-2-4-10(5-3-9)14(17)11-6-12(15(18)19)8-13(7-11)16(20)21/h2-8H,1H3
charge 0 multiplicity 1
31 atoms
O  1.117856 -1.674074 2.083468
O  -1.289804 3.125256 -1.168723
O  -3.492145 -3.276964 1.152393
O  -3.496156 2.561014 -1.31719
O  -5.00044 -1.793943 0.295023
N  -2.27448 2.310553 -0.996663
N  -3.806607 -2.141899 0.632422
C  -0.347583 -0.569861 0.551441
C  2.253732 -0.429039 0.358594
C  1.035743 -0.936376 1.05255
C  -1.397611 -1.492673 0.78604
C  -0.639966 0.682556 -0.038583
C  -1.973584 0.982609 -0.387859
C  -2.708315 -1.15687 0.402659
C  4.679895 0.43534 -0.89016
C  2.270997 -0.065745 -1.016592
C  3.470287 -0.374733 1.095047
C  -3.032864 0.080363 -0.187028
C  3.469689 0.352468 -1.628061
C  4.657635 0.058165 0.481761
C  5.957843 0.926338 -1.540593
H  -1.18799 -2.44964 1.272587
H  0.134426 1.436225 -0.203386
H  1.362321 -0.148949 -1.622456
H  3.455991 -0.682596 2.145797
H  -4.059083 0.328106 -0.469472
H  3.470223 0.613845 -2.692521
H  5.584469 0.103514 1.065468
H  6.846856 0.429331 -1.114667
H  5.953003 0.753329 -2.630397
H  6.084559 2.014951 -1.380599
