program: Gaussian 09
title: 000257905
version: EM64L-G09RevD.01
frameworkgroup: C1[X(C14H8N2O7)]
method: RPBEPBE
basis: SDD
operation: Freq
keyword: #p
keyword: freq=noraman
keyword: PBEPBE/SDD
title: #p freq=noraman PBEPBE/SDD
converged: YES YES NO NO
title: Mulliken charges:
elementType: O O O O O O O N N C C C C C C C C C C C C C C H H H H H H H H
charge: -0.193940 -0.435465 -0.187046 -0.177765 -0.178156 -0.180414 -0.234064 0.021175 0.024489 0.380779 0.318554 0.022139 -0.506874 -0.508964 0.417642 0.416605 -0.502221 -0.347273 -0.347850 0.250794 -0.327632 -0.350458 0.119481 0.332271 0.329075 0.342493 0.263408 0.280366 0.284330 0.281384 0.393139
chargesum: 0.00000
title: Mulliken charges with hydrogens summed into heavy atoms:
elementType: O O O O O O O N N C C C C C C C C C C C C C C
charge: -0.193940 -0.042326 -0.187046 -0.177765 -0.178156 -0.180414 -0.234064 0.021175 0.024489 0.380779 0.318554 0.022139 -0.174603 -0.179889 0.417642 0.416605 -0.159728 -0.083865 -0.067484 0.250794 -0.043302 -0.069074 0.119481
polarizability: 3.17108416e+02 -1.07173291e+01 2.01524858e+02 1.55718337e+01 1.75261917e+01 1.04695398e+02
1716.lowfreq: -2.7458 -0.0009 -0.0008 -0.0008 0.8933 3.5337 20.5892 33.3569 41.9211
frequency: 20.5870 33.3564 41.9149 49.0324 52.2713 78.4877 83.5901 116.1039 132.1276 136.5048 175.4208 193.0606 201.9979 242.1578 254.9463 302.3467 318.6019 343.6170 370.0915 406.6429 427.9472 455.4105 462.7025 465.3086 498.1668 503.6630 544.8235 589.8274 599.5355 617.9722 629.4886 645.2873 682.9324 689.1618 697.4207 706.5405 723.6859 732.9612 752.1336 790.5630 807.4382 865.7880 868.3151 889.2304 960.1820 972.2958 977.2557 979.2657 987.7411 998.7160 1004.4628 1010.4556 1029.0666 1075.0445 1107.7118 1122.6209 1148.6478 1170.2271 1197.2547 1205.8482 1216.5200 1244.9892 1282.6519 1306.6011 1325.9617 1379.2871 1380.5452 1385.5326 1394.9924 1410.0375 1434.9467 1458.5096 1494.0701 1542.7281 1572.2626 1590.3802 1613.6921 1618.5009 1644.7976 3148.7266 3155.5786 3173.3158 3178.8270 3180.7890 3183.6204 3191.3510 3532.0974
redmass: 11.2335 8.6237 8.6603 15.3877 13.6021 5.5243 8.9699 9.2592 10.6957 11.5785 7.6795 6.2894 5.1298 7.1107 5.6494 9.0025 11.7836 11.1139 9.0727 2.8856 4.9158 5.1244 6.0307 5.7372 7.6526 7.3444 5.6353 3.4717 1.6151 4.3937 6.6263 4.5575 12.1152 3.8054 2.9773 8.2022 8.9367 3.6522 7.7825 4.8480 8.3622 5.4197 1.4504 1.7325 2.3466 1.4656 2.6578 1.5045 5.0226 1.3701 3.8507 1.4612 2.6884 1.4010 1.5807 1.3810 1.8123 4.6629 1.2321 13.5138 8.5620 1.2283 4.6389 1.3576 2.5949 6.2343 9.2264 10.3593 5.6999 3.8106 5.4749 3.8992 2.5384 10.4248 7.8115 8.0545 7.9998 6.3764 8.9706 1.0898 1.0887 1.0971 1.0919 1.0930 1.0957 1.0930 1.0643
irintensity: 0.0346 0.6333 0.8132 0.0331 0.2680 0.3745 4.3655 7.6173 0.9010 2.3228 2.4241 4.6518 0.1555 0.6968 3.2321 2.1498 0.4625 1.4612 6.7790 0.6312 15.4952 13.6536 18.9156 2.8171 3.8337 5.0735 10.9049 27.1074 70.0932 15.7408 2.0176 12.6837 47.1871 79.4753 36.5296 44.5617 0.8574 51.2046 4.1148 5.3411 2.9254 25.0706 7.0565 28.5744 29.4319 21.8805 25.4069 19.1940 3.6209 1.2489 143.2915 18.4385 150.9489 62.3370 78.8207 7.4062 87.7936 11.3358 32.8624 292.5353 239.9650 0.1398 251.4199 21.0328 73.6076 5.0891 38.8087 146.3594 13.3424 36.3783 18.0218 13.8126 19.2347 106.5678 34.1982 37.5267 24.3145 9.2289 267.8591 8.9049 0.3272 0.7437 16.5600 1.6799 1.4414 26.9328 62.3885
temp: 298.150 k
press: 1.00000 atm
elementType: 8 8 8 8 8 8 8 7 7 6 6 6 6 6 6 6 6 6 6 6 6 6 6 1 1 1 1 1 1 1 1
symmnumber: 1
zpe: 533458.3 jmol-1
zpe.correction: 0.203184 hartree
zpe.thermalcorrener: 0.222592 hartree
zpe.thermalcorrenthalpy: 0.223537 hartree
zpe.thermalcorrgfe: 0.152299 hartree
zpe.sumelectzpe: -1172.597995 hartree
zpe.sumelectthermal: -1172.578586 hartree
zpe.sumelectthermalent: -1172.577642 hartree
zpe.sumelectthermalfe: -1172.648880 hartree
dipole: -3.8015 0.9002 1.3284
dipole: 4.1263
quadrupole: -152.9475 -153.4370 -126.4128
quadrupole: -4.7386 -10.8334 5.4527
quadrupole: -8.6818 -9.1712 17.8530 -4.7386 -10.8334 5.4527
hfenergy: -1172.8011789 hartree
pointgroup: C01 [X(C14H8N2O7)]
dipole: 1.4443812 0.2123426 -0.7100599 debye
polarizability: 310.1254436|36.5658088|163.3129602|5.5198464|-52.0053018|149.8902681 unknown
InChI: InChI=1S/C14H8N2O7/c17-13(8-1-3-9(4-2-8)14(18)19)10-5-11(15(20)21)7-12(6-10)16(22)23/h1-7,18H
charge 0 multiplicity 1
31 atoms
O  0.362876 -1.742504 2.269456
O  5.501404 1.126099 -2.169968
O  -1.665805 3.102171 -1.190266
O  -4.213217 -3.211341 1.018676
O  -3.866476 2.59001 -1.515204
O  -5.608121 -1.705425 0.019752
O  6.518897 0.96049 -0.086852
N  -2.682434 2.315453 -1.091908
N  -4.456184 -2.077763 0.459363
C  -0.96451 -0.589486 0.644744
C  1.649398 -0.470698 0.679745
C  0.363457 -0.981448 1.255478
C  -2.052192 -1.485037 0.802002
C  -1.175061 0.662099 0.018432
C  -2.466774 0.988443 -0.443874
C  -3.317489 -1.122397 0.30821
C  -3.56079 0.114158 -0.32099
C  1.799579 -0.145533 -0.696755
C  2.774766 -0.381031 1.545602
C  4.156902 0.384941 -0.320194
C  3.047669 0.274643 -1.195956
C  4.015991 0.052866 1.05358
C  5.495036 0.838638 -0.799042
H  -1.907266 -2.441392 1.312983
H  -0.372156 1.396058 -0.090179
H  -4.553857 0.382329 -0.690432
H  0.956235 -0.253882 -1.38634
H  2.649728 -0.660131 2.596436
H  3.17517 0.516834 -2.254107
H  4.888945 0.139958 1.708025
H  6.411975 1.42358 -2.437819
