program: Gaussian 09
title: 000257897
version: EM64L-G09RevD.01
frameworkgroup: C1[X(C15H13BrO3)]
method: RPBEPBE
basis: SDD
operation: Freq
keyword: #p
keyword: freq=noraman
keyword: PBEPBE/SDD
title: #p freq=noraman PBEPBE/SDD
converged: YES YES NO NO
title: Mulliken charges:
elementType: Br O O O C C C C C C C C C C C C C C C H H H H H H H H H H H H H
charge: 0.022038 -0.291193 -0.257586 -0.231144 0.191640 0.206738 0.043114 0.302757 -0.341550 -0.507327 0.360653 -0.393074 -0.342946 -0.359829 -0.190366 -0.183861 -0.218609 -0.519002 -0.536042 0.261016 0.274310 0.246884 0.272430 0.279702 0.253905 0.255051 0.207105 0.229527 0.265893 0.224743 0.249989 0.225031
chargesum: 0.00000
title: Mulliken charges with hydrogens summed into heavy atoms:
elementType: Br O O O C C C C C C C C C C C C C C C
charge: 0.022038 -0.291193 -0.257586 -0.231144 0.191640 0.206738 0.043114 0.302757 -0.080534 -0.233017 0.360653 -0.146190 -0.070516 -0.080127 0.063540 0.071190 -0.218609 0.183523 0.163722
polarizability: 3.11627451e+02 6.95105057e+00 1.97355593e+02 9.57171498e+00 9.01992118e+00 1.06935739e+02
1716.lowfreq: -5.4245 -0.8466 -0.0005 0.0003 0.0007 4.1693 27.6351 38.5381 51.7998
frequency: 27.5056 38.4839 51.7909 73.4354 84.7007 101.4784 121.0922 156.7193 158.6959 163.7178 176.6434 213.5136 224.3383 245.4008 264.0510 292.6307 300.7357 325.7897 342.9452 407.2408 424.0959 460.3402 474.8873 506.8695 529.1635 545.5491 603.9953 621.6828 647.0335 674.5622 698.9043 706.5511 738.2247 773.0473 813.0472 840.2732 846.9981 856.8369 881.2851 909.5121 950.7943 966.0732 975.9646 987.6169 996.8764 1003.0422 1057.7242 1102.1287 1110.2973 1110.7688 1112.8188 1140.8739 1152.8863 1154.7747 1178.7089 1186.9629 1233.0305 1267.3204 1282.2490 1294.0349 1364.8334 1365.3414 1390.2902 1403.8834 1430.3348 1441.0465 1453.3784 1465.1375 1467.9265 1471.8502 1482.4452 1482.7406 1531.6090 1558.7847 1576.6896 1590.3745 1610.5592 2965.9047 2966.3152 3056.7935 3075.4726 3125.9833 3130.8656 3138.8924 3151.7795 3153.9484 3170.9924 3172.4975 3174.1138 3176.2271
redmass: 6.5435 6.0600 4.1023 6.6717 3.4052 3.2209 4.3654 6.2420 1.4231 3.9725 3.1036 1.5718 3.9332 3.5580 4.5482 4.3703 6.9607 5.2198 5.5013 3.0349 4.8839 4.5586 3.9225 4.9912 5.0296 5.5573 5.5509 7.0748 3.8586 4.2304 6.6566 6.2117 3.7263 2.6120 1.6097 1.3240 3.2196 2.1640 1.6879 6.0184 1.3984 7.3422 1.3337 1.4047 4.4863 3.1794 2.7231 1.9342 1.3701 1.2637 1.5624 1.5310 1.7365 1.5796 1.4532 1.2202 2.6571 2.2624 2.6870 1.2827 5.3390 5.3588 3.9479 2.5645 1.2812 1.3605 1.0820 2.2905 1.0517 1.0822 1.5224 1.5256 9.1936 7.5638 7.6462 6.5776 6.6224 1.0328 1.0334 1.1043 1.0995 1.1034 1.0998 1.0888 1.0885 1.0886 1.0940 1.0961 1.0928 1.0973
irintensity: 0.5587 0.3776 0.0831 1.8291 8.0491 6.5714 1.9142 3.1187 0.2909 6.3880 1.2225 1.4821 0.9719 2.0366 0.4939 6.9800 1.1708 4.3684 18.1052 1.5052 10.9828 12.4184 11.1477 17.6412 2.8869 24.1893 17.5228 2.7141 6.1672 15.8657 4.2808 14.0413 6.0215 40.8789 28.2903 7.7140 14.9278 31.9616 23.5225 137.0867 1.4548 15.3540 0.4637 8.1032 51.8982 65.6904 49.4690 104.0401 7.8249 1.1195 69.4358 24.3448 15.8871 61.8632 33.0137 24.7343 102.7443 263.6139 230.5402 13.0010 25.2824 16.7161 20.6770 4.3701 10.7649 8.8427 16.8657 28.5499 15.2439 48.5005 16.5001 38.1589 166.1330 143.3478 77.7526 91.7556 307.6723 84.6321 70.1916 42.7900 22.1466 21.1660 25.3383 7.6997 1.9058 0.0902 7.9274 7.0974 1.8016 2.3698
temp: 298.150 k
press: 1.00000 atm
elementType: 35 8 8 8 6 6 6 6 6 6 6 6 6 6 6 6 6 6 6 1 1 1 1 1 1 1 1 1 1 1 1 1
symmnumber: 1
zpe: 628851.3 jmol-1
zpe.correction: 0.239517 hartree
zpe.thermalcorrener: 0.257676 hartree
zpe.thermalcorrenthalpy: 0.258620 hartree
zpe.thermalcorrgfe: 0.191211 hartree
zpe.sumelectzpe: -817.136147 hartree
zpe.sumelectthermal: -817.117988 hartree
zpe.sumelectthermalent: -817.117043 hartree
zpe.sumelectthermalfe: -817.184453 hartree
dipole: -2.2515 -3.8401 1.4776
dipole: 4.6903
quadrupole: -112.4693 -107.7629 -122.0464
quadrupole: 11.3086 -3.1222 0.2557
quadrupole: 1.6236 6.3299 -7.9535 11.3086 -3.1222 0.2557
hfenergy: -817.375664 hartree
pointgroup: C01 [X(C15H13Br1O3)]
dipole: -1.2442633 -1.1721031 0.6950844 debye
polarizability: 307.3092307|-19.030264|200.9627114|19.2481717|-5.5061338|107.6468406 unknown
InChI: InChI=1S/C15H13BrO3/c1-18-12-7-8-13(14(9-12)19-2)15(17)10-3-5-11(16)6-4-10/h3-9H,1-2H3
charge 0 multiplicity 1
32 atoms
Br 5.844456 -2.414906 0.143034
O  -1.405528 2.297864 -1.511759
O  -4.68674 -0.969291 -0.292644
O  0.780285 2.349557 0.458965
C  -0.718374 0.504257 0.038566
C  -1.727168 1.175344 -0.727357
C  0.637848 1.103617 0.244888
C  1.850101 0.210507 0.233044
C  -1.077627 -0.70646 0.687425
C  -3.027136 0.647155 -0.818323
C  -3.363135 -0.549023 -0.137987
C  -2.382148 -1.235425 0.623339
C  1.87754 -1.034422 -0.449612
C  3.031452 0.670258 0.87402
C  3.05587 -1.81167 -0.486481
C  4.210934 -0.098883 0.858475
C  4.206389 -1.336238 0.176449
C  -1.705468 3.617305 -0.91182
C  -5.095125 -2.207674 0.380421
H  -0.325158 -1.228437 1.288565
H  -3.777674 1.144097 -1.439358
H  -2.618396 -2.15815 1.159869
H  0.987373 -1.38707 -0.979965
H  3.006564 1.643509 1.374839
H  3.078663 -2.762936 -1.025438
H  5.115301 0.254637 1.361386
H  -2.773923 3.682936 -0.625715
H  -1.482467 4.350893 -1.7011
H  -1.052052 3.778742 -0.037381
H  -4.5130 -3.07436 0.012825
H  -6.155982 -2.335883 0.121794
H  -4.985377 -2.121248 1.478436
