program: Gaussian 09
title: 000257888
version: EM64L-G09RevD.01
frameworkgroup: C1[X(C16H15BrO)]
method: RPBEPBE
basis: SDD
operation: Freq
keyword: #p
keyword: freq=noraman
keyword: PBEPBE/SDD
title: #p freq=noraman PBEPBE/SDD
converged: YES YES NO NO
title: Mulliken charges:
elementType: Br O C C C C C C C C C C C C C C C C H H H H H H H H H H H H H H H
charge: 0.001017 -0.266167 -0.283355 -0.283016 -0.559421 0.469411 0.472368 -0.401449 -0.440502 -0.417257 -0.415155 -0.356300 -0.350723 -0.184784 -0.182160 0.318372 -0.216310 -0.538102 0.255643 0.260638 0.236004 0.237452 0.236840 0.238797 0.247178 0.248085 0.249329 0.238870 0.249608 0.249319 0.220507 0.220096 0.245166
chargesum: 0.00000
title: Mulliken charges with hydrogens summed into heavy atoms:
elementType: Br O C C C C C C C C C C C C C C C C
charge: 0.001017 -0.266167 -0.027712 -0.022378 -0.085965 0.469411 0.472368 -0.164609 -0.201704 -0.170079 -0.167070 -0.106972 -0.111853 0.064825 0.067159 0.318372 -0.216310 0.147667
polarizability: 3.13904884e+02 -3.25932375e+00 1.64084585e+02 -1.25677328e+00 5.51725461e-01 1.02326665e+02
1716.lowfreq: -14.5548 -4.1911 -1.3231 -0.0004 -0.0003 0.0005 9.5053 13.6957 29.5562
frequency: -7.0559 13.1677 29.5431 58.7131 67.3586 99.0119 124.3655 154.1430 199.7477 211.4837 237.4327 258.3241 273.7982 325.0701 376.0839 380.3399 406.8674 413.9692 424.6673 474.7064 504.9017 510.5282 547.3486 605.7208 623.3772 631.8014 682.7935 714.3238 735.6202 753.7936 788.7838 816.7717 831.5049 834.4922 835.9942 899.3688 917.1064 928.5248 943.7085 958.0508 965.5797 973.7507 988.2669 993.2213 999.7285 1013.7261 1059.3050 1073.1206 1079.9560 1106.0052 1109.1948 1111.9956 1120.2742 1155.5317 1158.2919 1176.1567 1184.2098 1222.3889 1231.6978 1242.1271 1288.5710 1294.5858 1303.1431 1355.3768 1361.8403 1385.4683 1399.8028 1414.5081 1436.4821 1461.4270 1466.3253 1472.2176 1478.0054 1506.9419 1573.7892 1577.9854 1597.7181 1624.2136 2957.2892 3044.1363 3074.5522 3084.6063 3096.4184 3123.9917 3126.6127 3129.1847 3133.0914 3135.3912 3160.7152 3165.8750 3166.0633 3169.1759 3199.5027
redmass: 3.5568 4.1455 6.7521 3.7188 5.4227 4.6308 4.7191 6.1796 2.7383 2.6195 1.8993 4.2707 3.8299 5.5898 4.3925 4.5941 2.8868 2.9876 3.9426 3.2817 3.0693 3.2766 2.9531 3.5959 6.7993 6.5797 3.1809 3.8201 3.4050 3.0684 4.0623 1.3287 1.4182 1.3078 1.5040 2.0573 5.2092 2.3125 1.4263 1.3538 1.3767 1.3793 6.6347 3.7090 3.1556 1.8501 2.3933 1.2537 1.0985 1.3768 1.3382 1.2609 1.4473 1.3919 2.6708 1.2414 1.1224 2.1274 1.9559 1.5320 1.3812 1.3361 1.5848 6.1241 5.7491 3.3222 2.0842 3.6631 1.1717 1.3199 1.0502 1.0936 2.5128 2.8040 7.6988 7.3665 6.2571 6.4706 1.0331 1.1039 1.0862 1.0853 1.0590 1.0987 1.0893 1.0890 1.0894 1.0893 1.0942 1.0953 1.0955 1.0963 1.1164
irintensity: 0.6313 0.0454 0.0182 0.3535 1.0680 3.2526 2.1337 0.7452 0.6818 1.0003 0.0824 1.1590 3.8754 4.3614 1.5099 1.8708 0.0110 0.2154 2.2171 1.0478 15.4335 20.5947 25.2038 17.0220 0.0039 2.3903 11.5308 6.5400 5.7060 13.8012 4.1650 13.4821 17.4670 7.8044 77.9443 7.2039 9.6442 0.5517 0.0442 0.3218 0.4931 0.1038 28.7517 61.3582 36.2668 3.8544 23.5017 20.6350 6.4966 1.1551 13.7430 0.2241 5.9315 0.1681 7.4283 61.4323 0.5433 170.3039 14.4677 18.1277 6.2529 5.6329 8.5169 2.0011 14.1884 7.1015 2.7536 4.4206 9.9549 18.7596 13.1724 87.4773 99.8415 119.5918 0.1326 6.9481 2.0419 36.4722 73.8767 50.4670 8.7151 15.3603 10.3869 32.6829 15.2130 13.2908 8.8120 10.2342 18.0345 10.6554 4.8367 0.2625 20.7330
temp: 298.150 k
press: 1.00000 atm
elementType: 35 8 6 6 6 6 6 6 6 6 6 6 6 6 6 6 6 6 1 1 1 1 1 1 1 1 1 1 1 1 1 1 1
symmnumber: 1
zpe: 683802.5 jmol-1
zpe.correction: 0.260447 hartree
zpe.thermalcorrener: 0.276219 hartree
zpe.thermalcorrenthalpy: 0.277163 hartree
zpe.thermalcorrgfe: 0.214195 hartree
zpe.sumelectzpe: -706.061247 hartree
zpe.sumelectthermal: -706.045475 hartree
zpe.sumelectthermalent: -706.044531 hartree
zpe.sumelectthermalfe: -706.107499 hartree
dipole: -3.5523 1.8463 -0.3764
dipole: 4.0212
quadrupole: -105.3050 -109.4535 -117.8231
quadrupole: -5.1259 4.6366 1.4571
quadrupole: 5.5555 1.4071 -6.9626 -5.1259 4.6366 1.4571
hfenergy: -706.321694 hartree
pointgroup: C01 [X(C16H15Br1O1)]
dipole: -1.3468383 0.8246043 -0.0944283 debye
polarizability: 312.6761578|-13.2352669|165.0576185|-4.9615283|3.3669363|102.5823575 unknown
InChI: InChI=1S/C16H15BrO/c1-18-14-8-4-12(5-9-14)16-10-15(16)11-2-6-13(17)7-3-11/h2-9,15-16H,10H2,1H3
charge 0 multiplicity 1
33 atoms
Br 6.819655 -1.202789 -0.312558
O  -5.52453 -1.037326 0.392681
C  -0.150349 0.787671 -0.562619
C  0.908511 0.804858 0.55087
C  0.391105 2.130177 -0.038741
C  -1.5661 0.354431 -0.289092
C  2.318859 0.339093 0.307587
C  -1.842624 -0.922135 0.272168
C  -2.66201 1.182727 -0.627552
C  2.580581 -0.916854 -0.296681
C  3.421789 1.128453 0.722818
C  -3.163159 -1.355574 0.486555
C  -3.997584 0.767127 -0.420304
C  3.902407 -1.380775 -0.484659
C  4.751345 0.684047 0.546204
C  -4.247259 -0.510717 0.138359
C  4.973583 -0.570895 -0.056758
C  -6.678877 -0.202943 0.053552
H  0.2328 0.502971 -1.55306
H  0.523562 0.573209 1.553712
H  1.064956 2.696998 -0.689115
H  -0.270582 2.739218 0.585225
H  -1.008914 -1.579147 0.54809
H  -2.468337 2.172215 -1.058795
H  1.742354 -1.540985 -0.627406
H  3.239107 2.104308 1.18737
H  -3.382048 -2.336152 0.920311
H  -4.819902 1.435753 -0.69236
H  4.091462 -2.35093 -0.953147
H  5.593797 1.302032 0.870111
H  -6.709232 0.02347 -1.030313
H  -6.676222 0.743439 0.629279
H  -7.558243 -0.802478 0.331167
