program: Gaussian 09
title: 000257882
version: EM64L-G09RevD.01
frameworkgroup: C1[X(C21H18)]
method: RPBEPBE
basis: SDD
operation: Freq
keyword: #p
keyword: freq=noraman
keyword: PBEPBE/SDD
title: #p freq=noraman PBEPBE/SDD
converged: YES YES NO NO
title: Mulliken charges:
elementType: C C C C C C C C C C C C C C C C C C C C C H H H H H H H H H H H H H H H H H H
charge: -0.567679 0.291905 0.292271 0.143377 0.143220 0.558679 -0.439957 -0.439889 -0.548115 -0.546285 0.476337 0.476539 -0.417479 -0.419526 -0.460184 -0.383759 -0.825816 -0.825897 -0.229442 -0.225032 -0.250800 0.249746 0.246908 0.246909 0.240936 0.240875 0.228657 0.228659 0.229911 0.242619 0.223710 0.225136 0.234430 0.223711 0.225312 0.234256 0.224495 0.224049 0.227212
chargesum: 0.00000
title: Mulliken charges with hydrogens summed into heavy atoms:
elementType: C C C C C C C C C C C C C C C C C C C C C
charge: -0.317932 0.291905 0.292271 0.143377 0.143220 0.558679 -0.193048 -0.192980 -0.307179 -0.305410 0.476337 0.476539 -0.188822 -0.190867 -0.230274 -0.141140 -0.142540 -0.142618 -0.004947 -0.000982 -0.023588
polarizability: 2.73280875e+02 -8.49441184e-05 2.68587456e+02 -2.05803013e+01 4.76478551e-03 1.47826660e+02
1716.lowfreq: -24.5431 -17.3551 -9.6554 -6.5737 -0.0006 -0.0005 0.0003 4.5373 4.8074
frequency: -24.5188 -17.2497 -4.3392 43.5386 47.6294 85.4425 99.5614 133.8736 162.8637 212.2024 221.7948 267.3967 290.5769 298.4658 330.8040 358.4806 401.8942 402.7813 419.5062 442.4785 456.8986 496.1102 503.5952 570.0806 576.6716 611.8825 615.6991 630.3355 643.3079 703.3793 704.3815 725.2896 745.3190 762.0169 795.1915 800.1979 825.6815 853.0811 853.8753 856.7291 858.2718 894.7962 899.5775 922.7400 927.1088 961.7835 962.9051 976.3195 989.5470 991.0632 994.6460 999.8675 1026.5112 1030.9162 1047.0305 1047.2098 1078.3847 1109.7795 1127.8793 1153.7697 1171.0482 1177.0797 1187.5229 1188.5334 1192.7847 1207.0942 1214.8316 1243.4681 1254.5919 1285.4281 1300.2119 1332.1750 1364.2962 1382.6324 1390.1936 1395.3783 1396.1561 1404.0235 1441.2383 1447.4329 1470.9174 1472.0780 1474.0168 1476.6541 1478.7434 1482.8935 1491.7625 1586.0126 1590.1429 1593.5873 1611.8202 1624.0556 1627.5282 2959.5834 2973.2884 2973.6437 3053.6231 3053.7444 3083.0293 3083.3418 3111.9425 3116.5062 3118.8529 3119.2933 3119.9539 3121.9298 3133.7183 3142.7457 3143.2222 3144.9081 3161.8501
redmass: 1.0139 1.0151 3.7576 4.3104 4.6101 4.1311 3.6331 3.8114 3.9777 4.3326 3.6679 4.4269 2.9321 4.5639 4.0864 3.7328 4.3761 2.8115 2.9343 2.9427 3.9595 3.7266 4.3761 5.2253 3.9640 3.4188 6.3174 4.4017 6.8893 4.4457 1.7398 5.5369 2.6333 2.4984 4.0407 1.9877 1.3804 2.9826 1.2685 2.9195 2.5654 1.3500 1.5751 3.6752 1.5787 1.3738 1.3954 1.3866 1.4525 6.2971 1.3157 1.4780 2.2140 2.4468 1.5679 1.5607 1.6320 2.6019 1.5676 1.7818 1.0586 1.3188 1.1163 1.9875 1.8547 1.3527 3.7245 1.9188 2.7523 1.4027 1.9482 1.2870 5.6555 7.8911 3.6328 1.2272 1.3577 3.4489 2.1808 2.8790 1.0988 1.2400 1.0835 1.6098 1.7285 2.3662 2.8928 6.8097 6.3608 6.2420 6.1081 7.5460 6.9559 1.0816 1.0383 1.0383 1.0954 1.0955 1.0995 1.0994 1.0875 1.0912 1.0891 1.0878 1.0899 1.0859 1.0912 1.0966 1.0967 1.0961 1.1015
irintensity: 0.5761 0.5425 0.0004 0.2758 0.1106 1.9277 0.0259 0.4160 2.1076 0.8901 0.0021 0.0190 1.2513 0.3724 0.0570 0.4345 0.3808 0.1079 8.7802 0.0040 4.3820 2.7029 7.9087 2.3149 3.4818 0.0086 0.6020 22.7079 8.0881 2.9848 47.5423 0.1505 19.2990 16.5247 13.7969 54.6604 0.0078 14.5522 0.0205 0.2236 11.0694 7.2548 0.2731 2.6809 0.9708 0.3660 1.3002 0.0112 0.0864 0.4927 0.0667 1.5018 8.3982 3.7751 5.7788 28.6720 11.8575 4.8251 4.1274 2.2616 0.1441 0.2800 0.7417 0.5228 4.9107 0.7818 0.0361 0.4393 1.1358 0.0572 0.1900 2.4866 17.6221 0.1670 3.4877 6.6177 9.1701 2.0302 9.8309 10.6298 21.0544 24.3828 17.3838 14.2337 12.1917 19.7010 18.3707 0.0052 4.7709 6.6503 10.2621 25.4119 7.0012 10.6702 45.7659 47.0585 14.3003 30.3234 18.7938 15.8464 9.3247 4.6246 3.5353 11.3468 37.4657 0.8112 14.9402 34.8919 6.4676 42.9124 27.6539
temp: 298.150 k
press: 1.00000 atm
elementType: 6 6 6 6 6 6 6 6 6 6 6 6 6 6 6 6 6 6 6 6 6 1 1 1 1 1 1 1 1 1 1 1 1 1 1 1 1 1 1
symmnumber: 1
zpe: 834518.7 jmol-1
zpe.correction: 0.317851 hartree
zpe.thermalcorrener: 0.333102 hartree
zpe.thermalcorrenthalpy: 0.334046 hartree
zpe.thermalcorrgfe: 0.275128 hartree
zpe.sumelectzpe: -809.628131 hartree
zpe.sumelectthermal: -809.612880 hartree
zpe.sumelectthermalent: -809.611936 hartree
zpe.sumelectthermalfe: -809.670854 hartree
dipole: -0.4337 -0.0035 0.0952
dipole: 0.4440
quadrupole: -108.7584 -114.2055 -121.0398
quadrupole: 0.0035 -4.7835 0.0065
quadrupole: 5.9095 0.4624 -6.3719 0.0035 -4.7835 0.0065
hfenergy: -809.9459825 hartree
pointgroup: C01 [X(C21H18)]
dipole: -0.1699897 -0.0013258 0.0402047 debye
polarizability: 272.578997|-0.0014655|268.5874571|-22.6077332|0.0069914|148.5285372 unknown
InChI: InChI=1S/C21H18/c1-14-8-10-17-19(12-14)20-13-15(2)9-11-18(20)21(17)16-6-4-3-5-7-16/h3-13,21H,1-2H3
charge 0 multiplicity 1
39 atoms
C  0.700085 -0.000215 -0.924126
C  -0.193035 -1.190245 -0.547162
C  -0.192315 1.190381 -0.547209
C  -1.461107 -0.738155 -0.075366
C  -1.46071 0.739024 -0.075385
C  2.088801 -0.000611 -0.280659
C  0.081779 -2.564531 -0.625112
C  0.083237 2.564444 -0.625322
C  -2.455311 -1.663229 0.307198
C  -2.454409 1.664618 0.306933
C  -2.193435 -3.055732 0.223781
C  -2.191739 3.057049 0.223436
C  -0.919894 -3.488967 -0.23713
C  -0.918033 3.489516 -0.237503
C  3.255566 -0.000625 -1.083591
C  2.232762 -0.000936 1.1314
C  -3.261644 -4.068228 0.603726
C  -3.259424 4.069835 0.604133
C  4.541674 -0.000949 -0.493995
C  3.513315 -0.00126 1.723027
C  4.674437 -0.001267 0.912207
H  0.847263 -0.000273 -2.025324
H  1.059952 -2.921406 -0.967015
H  1.061562 2.920787 -0.967343
H  -3.430522 -1.316816 0.671589
H  -3.429891 1.318761 0.671169
H  -0.712005 -4.564704 -0.289312
H  -0.709568 4.565116 -0.289914
H  3.156909 -0.000384 -2.176858
H  1.335973 -0.000936 1.762329
H  -2.820306 -5.052015 0.840449
H  -3.842803 -3.734665 1.482228
H  -3.980563 -4.219549 -0.225087
H  -2.819716 5.059199 0.819423
H  -3.825448 3.746677 1.496397
H  -3.991759 4.204771 -0.215668
H  5.434304 -0.000956 -1.129948
H  3.609741 -0.001506 2.814869
H  5.668774 -0.00152 1.372835
