program: Gaussian 09
title: 000257875
version: EM64L-G09RevD.01
frameworkgroup: C1[X(C16H14O)]
method: RPBEPBE
basis: SDD
operation: Freq
keyword: #pfreq=noraman
keyword: PBEPBE/SDD
title: #p freq=noraman PBEPBE/SDD
converged: YES YES NO NO
title: Mulliken charges:
elementType: O C C C C C C C C C C C C C C C C H H H H H H H H H H H H H H
charge: -0.227987 0.489092 0.299299 -0.620162 -0.451899 -0.382899 -0.360203 -0.370974 0.007262 0.291258 -0.370773 -0.361027 -0.027788 -0.237361 -0.232243 -0.230108 -0.586152 0.218568 0.229151 0.235067 0.247576 0.270941 0.266059 0.267104 0.271482 0.232483 0.231011 0.232429 0.232594 0.217716 0.220485
chargesum: 0.00000
title: Mulliken charges with hydrogens summed into heavy atoms:
elementType: O C C C C C C C C C C C C C C C C
charge: -0.227987 0.489092 0.299299 -0.172443 -0.216833 -0.135323 -0.089262 -0.104915 0.007262 0.291258 -0.103668 -0.089545 0.204694 -0.006350 0.000186 0.002487 -0.147951
polarizability: 2.63704376e+02 9.18825965e-02 1.77339098e+02 -4.78355050e+00 2.89082977e+00 9.92226289e+01
1716.lowfreq: -9.6527 -3.2296 0.0004 0.0006 0.0007 5.0057 29.6137 39.9873 47.5121
frequency: 29.5229 39.8924 47.5042 76.5000 80.6257 112.6513 156.6541 182.8659 223.9635 250.6416 296.1994 357.1776 373.7210 399.0455 402.8047 413.3310 440.4429 490.0748 547.5869 581.1103 613.5214 632.3155 647.2123 686.8796 697.4189 707.5490 748.6714 790.5392 811.2725 854.9464 861.9967 866.3193 906.4649 918.8862 936.0269 946.0150 951.2082 978.6896 986.9867 989.2577 992.8285 1004.1586 1013.7616 1015.8732 1026.7212 1083.6985 1109.7738 1120.0918 1150.8398 1174.0904 1187.0711 1193.5274 1205.0978 1214.7820 1279.5707 1283.6393 1292.5740 1315.6179 1320.0122 1377.4322 1382.9953 1408.6868 1426.1600 1433.0191 1451.5806 1475.9406 1497.6479 1533.0420 1572.6663 1587.7145 1607.3468 1616.1144 1655.8772 2968.2963 3019.5567 3084.2298 3097.3948 3124.2197 3127.3750 3130.3602 3137.7141 3149.0633 3153.8152 3158.7403 3159.7133 3168.9436 3196.9621
redmass: 3.5076 3.8797 4.5953 3.5556 3.0834 4.7769 3.6928 4.3373 4.8829 5.0205 3.8770 5.0842 3.6803 2.7210 2.7567 2.9186 3.3467 3.5723 2.4906 3.4036 6.4380 6.7367 2.9609 4.5855 3.0218 1.6285 3.2952 1.9829 3.5007 1.4215 1.5561 1.2736 1.9915 2.5580 2.1850 1.5152 1.4026 1.3543 1.4005 5.5740 1.3841 1.3364 2.0484 1.3702 2.1560 1.5871 1.6485 1.4521 3.3691 1.0569 1.1186 1.1842 1.8273 1.5270 1.5266 2.7222 1.3368 1.4346 1.3303 4.5816 8.6898 3.0980 1.2048 2.2620 1.1040 2.2262 2.5645 9.6556 6.7960 6.4512 6.0242 6.3017 4.6800 1.0592 1.0999 1.0637 1.0900 1.0891 1.0851 1.0878 1.0883 1.0929 1.0949 1.0959 1.0958 1.1011 1.1144
irintensity: 0.6530 1.2601 0.6128 0.0839 0.9734 1.3280 1.4508 1.0978 2.6559 1.0392 1.7355 1.6065 0.6220 2.1746 1.9845 0.1080 3.5218 13.1556 7.8046 17.2292 0.4523 1.6323 10.1757 7.4793 10.0552 94.9718 23.6733 19.8263 6.2239 11.5194 26.4652 3.6566 68.1353 17.8361 4.5684 2.5960 82.4260 0.3146 8.6650 1.0574 1.0396 1.6330 2.6991 23.9764 4.5527 10.0567 9.4322 6.7051 5.6088 0.3096 38.9992 3.6166 1.1890 7.7869 87.3396 234.6649 6.9170 32.7071 5.5047 6.8673 2.0243 14.7083 5.7432 14.7502 17.8357 1.1819 1.6635 149.2802 14.9310 17.0287 34.6168 54.3297 15.2228 24.1994 12.8140 16.1153 8.4692 14.9197 0.7248 8.5792 7.3398 23.4889 6.3858 16.0550 7.3173 22.3040 26.1242
temp: 298.150 k
press: 1.00000 atm
elementType: 8 6 6 6 6 6 6 6 6 6 6 6 6 6 6 6 6 1 1 1 1 1 1 1 1 1 1 1 1 1 1
symmnumber: 1
zpe: 650295.0 jmol-1
zpe.correction: 0.247684 hartree
zpe.thermalcorrener: 0.262532 hartree
zpe.thermalcorrenthalpy: 0.263477 hartree
zpe.thermalcorrgfe: 0.203828 hartree
zpe.sumelectzpe: -692.124317 hartree
zpe.sumelectthermal: -692.109469 hartree
zpe.sumelectthermalent: -692.108525 hartree
zpe.sumelectthermalfe: -692.168173 hartree
dipole: -1.4542 -3.2052 0.1563
dipole: 3.5231
quadrupole: -85.2272 -100.3168 -99.6070
quadrupole: -9.7845 -1.7951 -0.0445
quadrupole: 9.8231 -5.2665 -4.5567 -9.7845 -1.7951 -0.0445
hfenergy: -692.3720012 hartree
pointgroup: C01 [X(C16H14O1)]
dipole: 0.5705827 1.1998845 -0.3949267 debye
polarizability: 263.6517415|2.2027195|165.2450661|5.1677271|-28.3934126|111.3692953 unknown
InChI: InChI=1S/C16H14O/c1-2-6-13-9-11-15(12-10-13)16(17)14-7-4-3-5-8-14/h2-5,7-12H,1,6H2
charge 0 multiplicity 1
31 atoms
O  -1.768998 -2.311665 0.894587
C  2.8916 -0.401065 0.253302
C  0.069659 -0.838053 0.419806
C  4.402536 -0.190944 0.144879
C  2.352926 -1.336281 1.176286
C  1.996591 0.305871 -0.590877
C  0.965917 -1.561554 1.251307
C  0.604873 0.096415 -0.508497
C  -1.395379 -1.15843 0.50685
C  -2.428255 -0.126401 0.141256
C  -2.214651 1.268312 0.313899
C  -3.695021 -0.581464 -0.315009
C  4.815271 1.265249 0.024986
C  -3.246944 2.187733 0.024752
C  -4.71782 0.337883 -0.62029
C  -4.496153 1.726733 -0.451523
C  5.575426 1.778502 -0.974544
H  4.886404 -0.637113 1.037066
H  4.790157 -0.747211 -0.732265
H  3.030229 -1.892186 1.836084
H  2.400196 1.022066 -1.316008
H  0.548593 -2.298615 1.945347
H  -0.064404 0.633094 -1.18897
H  -1.258254 1.629922 0.705596
H  -3.854091 -1.660407 -0.413729
H  4.461192 1.927811 0.829452
H  -3.079717 3.259906 0.175797
H  -5.686816 -0.02202 -0.983121
H  -5.293647 2.442239 -0.681642
H  5.856144 2.837395 -0.996317
H  5.942737 1.15228 -1.797663
