program: Gaussian 09
title: 000257878
version: EM64L-G09RevD.01
frameworkgroup: C1[X(C14H16N2O2)]
method: RPBEPBE
basis: SDD
operation: Freq
keyword: #p
keyword: freq=noraman
keyword: PBEPBE/SDD
title: #p freq=noraman PBEPBE/SDD
converged: YES YES NO NO
title: Mulliken charges:
elementType: O O N N C C C C C C C C C C C C C C H H H H H H H H H H H H H H H H
charge: -0.270319 -0.270323 -0.439156 -0.439092 0.481150 0.481105 -0.449814 -0.449821 -0.353052 -0.353003 0.311687 0.311686 -0.321589 -0.321601 -0.341610 -0.341599 -0.538020 -0.538018 0.292063 0.292032 0.216116 0.216120 0.257843 0.257848 0.235905 0.235906 0.245281 0.245281 0.215464 0.216300 0.241734 0.241733 0.215464 0.216299
chargesum: 0.00000
title: Mulliken charges with hydrogens summed into heavy atoms:
elementType: O O N N C C C C C C C C C C C C C C
charge: -0.270319 -0.270323 -0.147092 -0.147061 0.481150 0.481105 -0.233698 -0.233701 -0.095209 -0.095154 0.311687 0.311686 -0.085684 -0.085695 -0.096328 -0.096318 0.135478 0.135478
polarizability: 2.66039543e+02 -1.12939072e-02 1.43772404e+02 -2.09473505e+01 4.07228761e-03 1.33945465e+02
1716.lowfreq: -16.6069 0.0002 0.0006 0.0007 2.1628 7.3949 14.7327 17.1969 45.7947
frequency: -16.0918 14.1539 45.7943 76.6095 77.3451 129.0103 132.4401 174.6935 184.9561 225.1835 227.5714 240.1428 252.8190 262.6504 324.4012 355.1782 356.0437 409.3092 409.8998 412.4449 434.2895 459.8749 490.6375 512.6310 535.3775 554.4854 608.9910 629.1548 663.1278 709.3072 715.3923 718.1704 719.2334 791.5914 792.7476 820.3172 823.3247 827.6324 832.2399 907.2260 907.2326 949.7529 952.8012 987.5331 988.2671 999.6877 1000.0247 1109.1763 1113.8681 1113.8731 1115.5475 1156.2463 1157.3363 1167.4206 1177.6763 1179.3902 1214.8080 1220.4156 1258.6330 1297.9133 1300.4902 1348.0096 1362.5832 1366.1304 1422.1520 1425.0223 1436.9996 1438.0877 1465.5380 1465.5473 1469.0091 1474.6114 1477.1613 1478.9094 1507.0502 1508.7438 1594.3726 1594.4289 1634.8617 1637.2002 2948.9684 2949.1496 3031.9696 3031.9840 3114.0981 3114.1456 3118.5846 3118.6155 3150.8820 3151.5699 3158.2982 3158.4035 3172.0563 3172.6105 3502.2274 3514.5161
redmass: 3.5324 5.7510 3.6470 3.5703 3.4502 4.5355 4.8250 3.9968 4.5482 2.1202 1.2198 1.3324 1.6823 2.1332 4.3162 5.3855 5.5851 4.6650 2.8432 3.2732 4.6353 1.3761 4.6639 2.3545 1.6982 4.8200 6.1181 7.0815 5.6762 3.6378 3.4557 5.4108 5.3419 1.3589 1.3796 5.6762 1.6066 4.7594 1.5240 1.3716 1.3713 1.3320 1.3295 4.5691 4.9207 3.4076 3.6377 1.4641 1.2600 1.2600 1.3078 1.3898 1.3236 2.3847 1.1921 1.2852 2.5584 3.5011 3.3375 1.2878 1.3274 2.8544 4.6192 5.2860 3.4249 3.8485 1.1732 1.1786 1.0505 1.0504 1.4040 1.1396 1.1548 1.4793 2.3340 2.6631 5.9126 5.5814 6.4208 6.4310 1.0334 1.0335 1.1034 1.1034 1.0890 1.0890 1.0983 1.0983 1.0874 1.0874 1.0936 1.0936 1.0966 1.0965 1.0772 1.0771
irintensity: 8.5948 0.7363 1.4777 1.2485 1.5203 0.7427 4.6515 0.0155 17.0064 4.8656 83.1925 0.5198 8.8123 0.4345 1.5142 8.5833 1.3203 2.1272 3.0408 0.0818 1.5986 83.9851 5.8228 28.2425 108.9705 8.7584 4.1433 0.5016 4.8692 0.0314 1.2395 37.8713 5.8957 31.1349 32.3905 1.2883 75.0437 11.1531 40.7580 0.2206 0.2465 0.1820 0.1747 0.9696 32.9410 106.7146 2.3945 5.7948 0.1757 0.1828 21.0802 0.1645 1.7294 3.8527 45.4418 1.6019 422.0452 97.0900 12.2030 0.0890 0.7149 0.6320 61.0951 2.4123 9.8537 18.7896 27.5297 7.1485 11.4921 12.6745 54.9301 192.7314 6.9010 56.1365 383.8462 130.8037 2.4554 0.4162 17.2471 1.1864 171.0019 0.5749 59.7496 54.7592 30.8951 28.7557 24.0384 16.9276 14.0439 2.7747 36.9612 2.0806 7.0615 1.9701 5.8084 82.5981
temp: 298.150 k
press: 1.00000 atm
elementType: 8 8 7 7 6 6 6 6 6 6 6 6 6 6 6 6 6 6 1 1 1 1 1 1 1 1 1 1 1 1 1 1 1 1
symmnumber: 1
zpe: 716198.2 jmol-1
zpe.correction: 0.272785 hartree
zpe.thermalcorrener: 0.289341 hartree
zpe.thermalcorrenthalpy: 0.290286 hartree
zpe.thermalcorrgfe: 0.227670 hartree
zpe.sumelectzpe: -801.662471 hartree
zpe.sumelectthermal: -801.645915 hartree
zpe.sumelectthermalent: -801.644970 hartree
zpe.sumelectthermalfe: -801.707586 hartree
dipole: -0.0012 2.3081 -0.0014
dipole: 2.3081
quadrupole: -82.0131 -103.5264 -101.8275
quadrupole: -0.0092 -18.5273 0.0013
quadrupole: 13.7759 -7.7374 -6.0385 -0.0092 -18.5273 0.0013
hfenergy: -801.9352561 hartree
pointgroup: C01 [X(C14H16N2O2)]
dipole: 0.0005282 -0.0002601 -0.9080866 debye
polarizability: 264.5607632|-25.1384691|135.4242575|0.0160269|0.0104063|143.7723913 unknown
InChI: InChI=1S/C14H16N2O2/c1-17-13-7-3-11(4-8-13)15-16-12-5-9-14(18-2)10-6-12/h3-10,15-16H,1-2H3
charge 0 multiplicity 1
34 atoms
O  4.969386 0.463608 1.486483
O  -4.970006 -0.461566 1.486411
N  0.559629 -0.408257 -1.967142
N  -0.559751 0.405145 -1.967875
C  1.662006 -0.205922 -1.100013
C  -1.662218 0.20414 -1.100531
C  2.780196 -1.07499 -1.174913
C  -2.780141 1.073456 -1.176494
C  1.681796 0.861774 -0.160535
C  -1.682398 -0.862512 -0.15988
C  3.91091 0.1779 0.597583
C  -3.911376 -0.177141 0.597284
C  3.899119 -0.890206 -0.332008
C  -3.899195 0.889936 -0.333483
C  2.796516 1.048182 0.675688
C  -2.797242 -1.047664 0.676454
C  6.130631 -0.421766 1.442704
C  -6.130998 0.424091 1.441583
H  0.539905 -1.238852 -2.562376
H  -0.539485 1.235434 -2.563536
H  2.781748 -1.901556 -1.897023
H  -2.781392 1.899212 -1.899531
H  0.81901 1.529793 -0.083392
H  -0.819817 -1.530704 -0.081975
H  4.744824 -1.579788 -0.414799
H  -4.744695 1.579666 -0.417093
H  2.820615 1.863782 1.405118
H  -2.821648 -1.862449 1.406783
H  6.621598 -0.399879 0.448997
H  5.85526 -1.466061 1.692765
H  6.822351 -0.030954 2.203899
H  -6.8229 0.034283 2.203128
H  -6.621879 0.401289 0.447854
H  -5.855356 1.468574 1.690562
