program: Gaussian 09
title: 000257871
version: EM64L-G09RevD.01
frameworkgroup: C1[X(C13H12N2O)]
method: RPBEPBE
basis: SDD
operation: Freq
keyword: #p
keyword: freq=noraman
keyword: PBEPBE/SDD
title: #p freq=noraman PBEPBE/SDD
converged: NO YES NO NO
title: Mulliken charges:
elementType: O N N C C C C C C C C C C C C C H H H H H H H H H H H H
charge: -0.233611 -0.719017 -0.714727 0.420795 -0.007551 0.290042 -0.646905 -0.631144 0.564614 0.572386 -0.634700 -0.369605 -0.365044 -0.240212 -0.233453 -0.232742 0.262077 0.254759 0.207902 0.272450 0.269823 0.228535 0.229950 0.229889 0.302709 0.308312 0.312816 0.301654
chargesum: 0.00000
title: Mulliken charges with hydrogens summed into heavy atoms:
elementType: O N N C C C C C C C C C C C C C
charge: -0.233611 -0.107996 -0.100258 0.420795 -0.007551 0.290042 -0.384828 -0.376385 0.564614 0.572386 -0.426798 -0.097154 -0.095221 -0.011677 -0.003503 -0.002852
polarizability: 2.39852437e+02 -9.17029320e+00 1.67844137e+02 1.24256709e+01 6.01685591e+00 8.84383545e+01
1716.lowfreq: -8.8194 -3.7962 -0.0005 -0.0004 -0.0002 6.9110 36.4194 53.9519 77.9955
frequency: 36.3896 53.9036 77.9939 128.6387 180.9599 200.7153 214.8088 239.4688 251.8201 310.8709 337.5815 351.2282 360.8982 368.5422 384.7353 404.9005 412.5000 465.6348 495.2756 517.9904 549.7011 600.8629 614.1445 618.2693 660.4228 683.3650 702.0504 725.6982 798.7097 818.5206 837.5639 845.5635 862.6041 885.7458 943.1072 970.3319 982.4419 986.9436 988.9323 1001.2052 1002.3526 1025.5696 1059.3672 1072.6196 1083.1196 1143.0967 1172.7681 1186.3618 1222.9126 1258.2171 1296.0209 1316.3388 1382.2725 1395.5401 1410.8119 1432.5840 1468.4559 1475.6563 1495.0327 1536.1240 1586.2515 1604.7332 1607.7167 1628.5155 1639.7044 1643.8010 3108.4166 3125.0951 3135.8464 3143.8750 3148.9026 3149.9787 3157.8710 3167.3963 3570.7881 3571.6935 3712.2127 3712.5298
redmass: 5.6765 4.0919 4.6821 6.5557 4.8251 4.8739 3.6845 3.5363 4.5861 3.5503 1.2256 1.1480 1.3210 3.3440 1.0556 2.9473 3.7793 3.5040 4.6113 5.5596 5.9838 4.4078 6.3014 4.0947 5.8787 1.9247 1.8862 2.0003 2.2645 5.2990 1.5778 1.6812 1.2735 2.4357 1.4398 4.1903 3.0603 1.3960 5.7569 2.0676 1.4487 2.1496 1.8296 1.4225 1.5936 1.6570 1.0561 1.1167 1.6711 3.3005 1.3008 1.3358 8.7876 4.9284 8.0364 2.2786 4.7030 2.2772 3.7096 10.0337 6.2384 5.4481 6.0183 3.9580 1.2701 1.2114 1.0909 1.0849 1.0884 1.0912 1.0922 1.0922 1.0957 1.1010 1.0447 1.0449 1.1040 1.1040
irintensity: 2.7806 0.5090 1.5518 1.1384 1.1189 7.6588 6.7763 0.2441 0.4894 7.8988 65.3729 285.2468 171.7644 42.3224 32.2385 0.2677 0.0737 5.5955 1.6535 0.8973 2.0535 4.3671 0.1524 0.1628 26.4404 14.4082 27.8050 95.8915 9.8504 43.5475 4.7846 23.9985 2.0562 71.0073 2.3961 20.6804 2.4496 4.7069 1.2604 3.1541 1.4127 5.0992 1.0244 4.0586 9.3740 9.1144 0.2342 20.7878 88.3483 219.5067 5.0842 2.2812 1.9302 246.5534 29.9018 20.6774 32.7609 3.5381 4.8221 187.7720 11.6480 26.5406 23.4903 172.4368 353.8294 136.7001 30.5691 0.0815 9.2685 12.5109 5.3019 13.9931 21.4978 23.0915 90.4585 37.8173 18.4277 20.1734
temp: 298.150 k
press: 1.00000 atm
elementType: 8 7 7 6 6 6 6 6 6 6 6 6 6 6 6 6 1 1 1 1 1 1 1 1 1 1 1 1
symmnumber: 1
zpe: 578523.6 jmol-1
zpe.correction: 0.220348 hartree
zpe.thermalcorrener: 0.234543 hartree
zpe.thermalcorrenthalpy: 0.235487 hartree
zpe.thermalcorrgfe: 0.179360 hartree
zpe.sumelectzpe: -686.204936 hartree
zpe.sumelectthermal: -686.190741 hartree
zpe.sumelectthermalent: -686.189797 hartree
zpe.sumelectthermalfe: -686.245924 hartree
dipole: 2.5941 4.2058 0.6833
dipole: 4.9885
quadrupole: -62.1615 -85.7740 -96.3128
quadrupole: -3.1403 3.6097 -3.6533
quadrupole: 19.2546 -4.3579 -14.8967 -3.1403 3.6097 -3.6533
hfenergy: -686.4252845 hartree
pointgroup: C01 [X(C13H12N2O1)]
dipole: 1.2050727 1.1279554 1.0618134 debye
polarizability: 234.8535194|-25.8128701|146.4642938|7.9486937|37.561082|114.8171154 unknown
InChI: InChI=1S/C13H12N2O/c14-11-6-10(7-12(15)8-11)13(16)9-4-2-1-3-5-9/h1-8H,14-15H2
charge 0 multiplicity 1
28 atoms
O  -0.82531 -1.841033 -1.586052
N  2.753515 2.345687 0.924893
N  4.091706 -2.227147 -0.16914
C  0.752767 -0.566498 -0.284177
C  -0.639615 -0.931529 -0.714185
C  -1.833923 -0.232646 -0.117213
C  1.755458 -1.555811 -0.410281
C  1.073505 0.73864 0.167549
C  2.421298 1.056356 0.498819
C  3.098648 -1.251448 -0.062933
C  3.422966 0.055973 0.393051
C  -1.850425 0.246469 1.22058
C  -3.014456 -0.134951 -0.902214
C  -3.02447 0.821369 1.756216
C  -4.178822 0.456094 -0.373156
C  -4.186921 0.936716 0.959326
H  1.475835 -2.544071 -0.790046
H  0.301969 1.513729 0.217808
H  4.461281 0.29728 0.657623
H  -0.957202 0.141117 1.844707
H  -2.994875 -0.538216 -1.920165
H  -3.034538 1.172277 2.794256
H  -5.080257 0.538172 -0.990475
H  -5.094848 1.388743 1.374748
H  3.713232 2.593179 1.144315
H  2.042497 3.067142 0.991872
H  3.865934 -3.15523 -0.513412
H  5.057952 -2.020565 0.063689
