program: Gaussian 09
title: 000257873
version: EM64L-G09RevD.01
frameworkgroup: C1[X(C14H8Cl2O3)]
method: RPBEPBE
basis: SDD
operation: Freq
keyword: #p
keyword: freq=noraman
keyword: PBEPBE/SDD
title: #p freq=noraman PBEPBE/SDD
converged: YES YES NO NO
title: Mulliken charges:
elementType: Cl Cl O O O C C C C C C C C C C C C C C H H H H H H H H
charge: -0.025923 -0.040963 -0.192430 -0.437163 -0.230131 0.259312 0.102105 0.003228 0.364988 -0.326156 -0.317937 -0.341399 -0.339972 -0.112202 -0.210350 -0.211015 -0.210276 0.093821 -0.113689 0.287768 0.287917 0.250354 0.280703 0.266133 0.259098 0.261441 0.392737
chargesum: 0.00000
title: Mulliken charges with hydrogens summed into heavy atoms:
elementType: Cl Cl O O O C C C C C C C C C C C C C C
charge: -0.025923 -0.040963 -0.192430 -0.044426 -0.230131 0.259312 0.102105 0.003228 0.364988 -0.038388 -0.030020 -0.091045 -0.059269 -0.112202 0.055783 0.048083 0.051165 0.093821 -0.113689
polarizability: 2.64214641e+02 1.65904944e+01 1.52379113e+02 9.17032620e+00 -8.11295063e+00 1.45287034e+02
1716.lowfreq: -6.4723 -1.1944 -0.0017 0.0010 0.0015 2.9791 13.2158 39.2374 48.4276
frequency: 13.1247 39.1769 48.4167 67.7342 82.1152 100.2972 123.0225 149.7504 165.1986 211.0213 254.0672 266.6082 292.6750 296.5674 313.6525 333.5212 383.8902 407.0903 441.3585 457.9483 487.0481 513.3126 524.6625 591.0707 602.9114 622.3296 629.1147 653.6300 674.5910 690.8928 719.3132 747.2316 769.2809 791.9692 834.2332 846.3798 852.7773 892.5260 935.0758 966.3250 981.0687 988.2171 1000.5991 1004.7979 1070.8359 1079.8874 1108.6412 1110.9512 1156.9979 1162.8198 1182.7644 1255.2665 1271.1070 1293.2018 1323.4126 1371.7536 1376.4848 1380.2481 1399.0468 1465.1178 1474.1059 1550.4738 1562.4181 1584.6349 1590.5292 1598.0454 1634.8723 3143.7559 3157.2226 3168.1607 3170.4733 3172.4589 3177.2841 3186.9296 3532.5857
redmass: 12.8881 5.3984 6.0548 12.2172 6.1174 11.8332 10.3638 11.2538 7.5132 8.6033 7.2966 6.8719 13.5695 7.0244 7.3180 7.6029 5.8058 2.9103 3.6192 4.5694 4.7997 6.4474 6.4905 1.2500 6.0491 6.8140 5.2884 6.4037 4.2426 4.7291 6.0244 3.9856 4.5235 5.3019 1.2936 1.5012 1.6098 1.5566 5.9275 1.3537 1.3623 1.3818 3.7912 5.2864 2.8843 2.2136 1.8979 1.5833 1.9006 1.7215 1.1619 2.0898 1.8546 1.2589 2.6766 4.6042 9.3334 4.1398 4.2736 2.7248 2.4723 10.8410 8.4372 7.7446 6.9774 6.6767 8.8920 1.0891 1.0888 1.0892 1.0930 1.0959 1.0976 1.0974 1.0643
irintensity: 0.1802 0.0893 0.7963 0.8362 0.1040 2.8924 0.1816 2.8176 3.6615 2.8515 2.6988 0.7819 3.9595 0.3837 0.4364 1.6832 12.1973 0.2337 25.5168 16.7140 73.9618 25.6483 2.1709 78.7437 14.6504 2.8277 7.8911 5.6224 24.3631 42.3747 1.2366 46.9896 46.4470 40.6260 4.1576 30.2560 38.2036 24.3994 45.4374 0.2149 2.5690 2.1993 35.4297 269.8689 62.9518 77.6229 37.0236 6.4449 24.2233 59.2568 23.2831 127.1060 166.8078 3.9753 100.0730 2.4960 49.2367 18.1290 25.2977 9.5340 21.2817 188.6916 87.9487 55.2126 42.4603 70.9056 292.6214 5.3325 0.0840 0.2726 0.3578 3.5450 2.7420 1.3926 61.8253
temp: 298.150 k
press: 1.00000 atm
elementType: 17 17 8 8 8 6 6 6 6 6 6 6 6 6 6 6 6 6 6 1 1 1 1 1 1 1 1
symmnumber: 1
zpe: 475390.5 jmol-1
zpe.correction: 0.181067 hartree
zpe.thermalcorrener: 0.197825 hartree
zpe.thermalcorrenthalpy: 0.198769 hartree
zpe.thermalcorrgfe: 0.133700 hartree
zpe.sumelectzpe: -1682.776032 hartree
zpe.sumelectthermal: -1682.759274 hartree
zpe.sumelectthermalent: -1682.758330 hartree
zpe.sumelectthermalfe: -1682.823398 hartree
dipole: -1.0548 1.6051 -3.1976
dipole: 3.7301
quadrupole: -123.7396 -114.7399 -126.3918
quadrupole: -4.4405 8.2367 -4.3337
quadrupole: -2.1158 6.8838 -4.7680 -4.4405 8.2367 -4.3337
hfenergy: -1682.9570983 hartree
pointgroup: C01 [X(C14H8Cl2O3)]
dipole: -0.5636301 0.3001192 -1.3213358 debye
polarizability: 257.8328362|31.8729504|155.5551844|-1.8742382|-10.5671022|148.4927675 unknown
InChI: InChI=1S/C14H8Cl2O3/c15-9-3-1-8(2-4-9)13(17)12-7-10(16)5-6-11(12)14(18)19/h1-7,18H
charge 0 multiplicity 1
27 atoms
Cl -4.098569 -3.126755 0.276774
Cl 5.513555 -0.485285 -1.463217
O  0.011483 -0.019581 2.587373
O  -1.574072 2.922849 -1.443003
O  -0.014552 2.443799 0.208257
C  -1.21743 -0.214528 0.53194
C  -1.728219 0.792522 -0.339761
C  0.077971 -0.086154 1.325524
C  1.38597 -0.173268 0.606484
C  -1.958895 -1.40354 0.724391
C  -2.955438 0.581633 -1.021911
C  1.475145 -0.536436 -0.762821
C  2.576843 0.085806 1.33677
C  -3.169003 -1.586834 0.029124
C  -3.681591 -0.612026 -0.850865
C  2.730082 -0.637446 -1.398911
C  3.835443 -0.004645 0.715098
C  -1.009484 2.087571 -0.467947
C  3.891106 -0.365287 -0.648485
H  -1.592109 -2.169735 1.412962
H  -3.335998 1.369076 -1.677325
H  0.568391 -0.754011 -1.337421
H  2.492088 0.36263 2.392292
H  -4.626413 -0.776934 -1.375612
H  2.806232 -0.922248 -2.451996
H  4.754697 0.201771 1.270302
H  -1.067735 3.778656 -1.465114
