program: Gaussian 09
title: 000257870
version: EM64L-G09RevD.01
frameworkgroup: C1[X(C13H14N4O)]
method: RPBEPBE
basis: SDD
operation: Freq
keyword: #p
keyword: freq=noraman
keyword: PBEPBE/SDD
title: #p freq=noraman PBEPBE/SDD
converged: YES YES NO NO
title: Mulliken charges:
elementType: O N N N N C C C C C C C C C C C C C H H H H H H H H H H H H H H
charge: -0.239525 -0.716439 -0.716450 -0.719966 -0.720318 0.415234 0.416651 -0.026422 -0.629564 -0.631382 -0.651793 -0.652650 0.570456 0.570480 0.560279 0.561153 -0.638475 -0.638684 0.260841 0.260760 0.260795 0.260333 0.205602 0.205500 0.310927 0.299182 0.310879 0.299171 0.306820 0.299751 0.299887 0.306966
chargesum: 0.00000
title: Mulliken charges with hydrogens summed into heavy atoms:
elementType: O N N N N C C C C C C C C C C C C C
charge: -0.239525 -0.106331 -0.106400 -0.113395 -0.113465 0.415234 0.416651 -0.026422 -0.368723 -0.370621 -0.390998 -0.392317 0.570456 0.570480 0.560279 0.561153 -0.432873 -0.433184
polarizability: 2.68517887e+02 -2.11776637e-01 1.92999675e+02 -1.87803195e+01 -5.91559827e-02 1.06693249e+02
1716.lowfreq: -8.1743 -0.0011 -0.0010 -0.0009 4.3666 6.7944 32.8099 37.3366 64.9454
frequency: 32.7603 37.3131 64.9453 121.4049 169.0489 175.2151 213.1949 213.6998 219.1547 224.8692 249.0628 292.0645 317.5368 318.2346 327.1721 337.7140 339.0367 355.3244 361.3151 368.2713 379.2344 381.8577 413.0862 448.5063 496.9585 501.4522 521.0518 532.9756 555.1665 557.0184 616.9720 620.3651 631.9714 682.2314 700.5844 749.1739 761.3628 834.9931 837.1827 843.9958 861.1154 883.7422 890.1533 909.4306 972.3429 977.7987 986.6807 999.5775 1004.3559 1036.0253 1071.6467 1071.7261 1088.9911 1143.3214 1220.6669 1222.3811 1229.2276 1295.3663 1299.6329 1384.9401 1397.0987 1407.2786 1407.9392 1467.9148 1467.9932 1493.3837 1494.3336 1540.9578 1602.8169 1606.2878 1625.9325 1629.3576 1637.8310 1638.4969 1641.1612 1643.3287 3107.6834 3107.9374 3145.3637 3147.4322 3149.2593 3151.6415 3570.1849 3570.4515 3570.8493 3571.2298 3712.1527 3712.3593 3712.4785 3712.7069
redmass: 5.8915 4.8092 5.0767 6.8890 4.9945 5.2825 4.0233 3.7051 4.2640 3.2488 3.2880 3.2077 1.3540 2.3940 1.3301 1.2019 1.2013 1.1273 1.0743 5.0795 1.0466 1.0391 4.0729 3.0891 4.5402 4.4084 5.9893 4.6795 5.6595 6.0128 4.0146 4.2150 4.1438 1.6902 1.7157 7.8055 2.8207 1.6269 1.5479 1.6873 1.5652 1.9149 2.6251 4.6575 4.9708 6.0384 2.4952 2.4625 1.8147 1.5768 1.4190 1.4230 1.6574 1.4115 1.7151 1.6788 2.3242 1.2911 1.2716 4.4022 5.7735 7.9708 7.8868 4.6408 4.6673 3.6269 3.6719 10.8508 5.7101 5.2141 4.2190 3.5167 1.2361 1.3210 1.1991 1.2308 1.0909 1.0908 1.0910 1.0909 1.0919 1.0916 1.0446 1.0446 1.0448 1.0449 1.1040 1.1041 1.1041 1.1040
irintensity: 3.8323 0.3102 2.2101 1.4902 1.6987 4.0202 5.4088 18.1386 0.1615 0.9972 0.8165 11.6885 103.6137 18.2346 40.4290 176.5110 613.3810 112.6637 47.0852 14.0892 40.7114 0.1931 0.0013 1.5201 7.9669 0.6812 3.2685 0.4416 0.0711 0.0799 0.0613 0.1501 0.4920 20.6815 5.7773 78.5881 61.9046 16.6770 5.7475 38.8369 5.6948 22.5547 96.3695 0.1597 19.7869 0.7795 3.6709 8.4235 1.2353 0.1569 3.8631 4.9724 1.5001 3.6536 65.0235 99.8340 224.3440 0.6859 0.5485 31.4180 396.5626 58.3355 35.5300 37.8693 29.8367 1.1638 7.2995 236.4001 51.5295 51.4001 187.7199 126.7505 230.6546 451.1794 281.6947 9.0389 48.7947 17.2831 10.5551 4.9439 8.3549 2.9925 84.7637 95.2929 41.6192 17.6007 15.0256 20.4959 17.3961 20.0037
temp: 298.150 k
press: 1.00000 atm
elementType: 8 7 7 7 7 6 6 6 6 6 6 6 6 6 6 6 6 6 1 1 1 1 1 1 1 1 1 1 1 1 1 1
symmnumber: 1
zpe: 663906.2 jmol-1
zpe.correction: 0.252869 hartree
zpe.thermalcorrener: 0.270391 hartree
zpe.thermalcorrenthalpy: 0.271336 hartree
zpe.thermalcorrgfe: 0.208584 hartree
zpe.sumelectzpe: -796.758547 hartree
zpe.sumelectthermal: -796.741024 hartree
zpe.sumelectthermalent: -796.740080 hartree
zpe.sumelectthermalfe: -796.802831 hartree
dipole: 0.0050 5.0161 0.0748
dipole: 5.0166
quadrupole: -56.6317 -94.5102 -104.8477
quadrupole: -0.1213 -4.8349 -0.0828
quadrupole: 28.6981 -9.1803 -19.5178 -0.1213 -4.8349 -0.0828
hfenergy: -797.0114157 hartree
pointgroup: C01 [X(C13H14N4O1)]
dipole: -0.1928223 -1.5298508 1.2320067 debye
polarizability: 264.2873968|12.9353245|159.3101121|28.0381191|-41.1838109|144.6133026 unknown
InChI: InChI=1S/C13H14N4O/c14-9-1-7(2-10(15)5-9)13(18)8-3-11(16)6-12(17)4-8/h1-6H,14-17H2
charge 0 multiplicity 1
32 atoms
O  0.249997 1.934116 -1.722117
N  -4.634629 0.432804 -2.141822
N  4.857579 1.305055 0.450234
N  -3.11959 -1.161237 2.226719
N  2.655754 -3.055817 0.683049
C  -1.242915 0.428258 -0.584227
C  1.360443 0.287081 -0.363558
C  0.129416 0.939977 -0.935808
C  -1.511881 -0.179108 0.667645
C  1.395574 -1.097224 -0.062735
C  -2.281499 0.646923 -1.51894
C  2.514109 1.089991 -0.207723
C  -3.606306 0.234795 -1.216097
C  3.718066 0.514202 0.277906
C  -2.841289 -0.576672 0.985797
C  2.605214 -1.685349 0.404029
C  -3.878772 -0.378849 0.037562
C  3.755854 -0.874011 0.58421
H  -0.710459 -0.305857 1.402319
H  0.509609 -1.719315 -0.225017
H  -2.044205 1.150987 -2.461716
H  2.460829 2.148327 -0.483918
H  -4.903104 -0.694457 0.277701
H  4.687038 -1.32448 0.953698
H  -4.445153 0.886411 -3.030099
H  -5.589858 0.161731 -1.931002
H  4.837387 2.292342 0.214603
H  5.730711 0.903281 0.776729
H  -2.385002 -1.273498 2.918376
H  -4.069499 -1.406799 2.487212
H  3.519729 -3.496859 0.982081
H  1.840752 -3.64205 0.532605
