program: Gaussian 09
title: 000257869
version: EM64L-G09RevD.01
frameworkgroup: C1[X(C13H7ClN2O5)]
method: RPBEPBE
basis: SDD
operation: Freq
keyword: #p
keyword: freq=noraman
keyword: PBEPBE/SDD
title: #p freq=noraman PBEPBE/SDD
converged: YES YES NO NO
title: Mulliken charges:
elementType: Cl O O O O O N N C C C C C C C C C C C C C H H H H H H H
charge: -0.019581 -0.201330 -0.178461 -0.188148 -0.181023 -0.178617 0.024176 0.021119 0.379783 0.026319 -0.512746 -0.507318 0.311413 0.418062 0.417801 -0.502115 -0.340855 -0.339015 -0.210391 -0.206328 -0.115517 0.329231 0.331499 0.342210 0.264162 0.281980 0.266624 0.267067
chargesum: 0.00000
title: Mulliken charges with hydrogens summed into heavy atoms:
elementType: Cl O O O O O N N C C C C C C C C C C C C C
charge: -0.019581 -0.201330 -0.178461 -0.188148 -0.181023 -0.178617 0.024176 0.021119 0.379783 0.026319 -0.183515 -0.175819 0.311413 0.418062 0.417801 -0.159905 -0.076693 -0.057036 0.056233 0.060739 -0.115517
polarizability: 3.05529534e+02 1.33638474e+01 1.93059613e+02 1.00836328e+01 -1.64465259e+01 9.60319498e+01
1716.lowfreq: -3.3134 -2.1749 -0.0011 0.0005 0.0018 3.0326 21.9515 38.1625 47.1665
frequency: 21.9323 38.1622 47.1597 50.1664 60.7580 89.0927 117.6028 134.7379 144.2128 191.9376 202.1002 208.0875 258.1303 300.0120 305.1016 323.5829 345.2081 378.9040 410.1742 438.8309 463.9606 474.6285 499.8047 500.8692 547.0714 590.3322 623.3101 640.9899 682.1232 688.4986 697.3500 705.9902 723.8512 729.0864 765.0958 801.0177 836.1332 851.9396 867.7134 956.2474 968.0589 971.3533 974.3180 981.2762 986.3004 988.6482 1003.3634 1073.3261 1075.6001 1107.5862 1115.1005 1170.0043 1188.5096 1205.9692 1217.0392 1244.1437 1285.7721 1297.8863 1368.4642 1379.9767 1385.1514 1394.3794 1401.6942 1434.6683 1458.2826 1474.9454 1539.7511 1574.4285 1589.3178 1596.4746 1613.8564 3150.5107 3158.0154 3175.7587 3178.7888 3179.3406 3180.8962 3191.9453
redmass: 14.0613 10.0388 10.2575 13.0607 5.7060 10.9810 9.9651 13.4878 10.6253 5.7132 6.7843 6.8266 7.7818 6.1719 8.9059 11.8552 10.9761 8.9690 2.9490 5.7369 5.5057 4.3024 8.2223 7.3860 5.8494 5.8179 7.0792 5.2904 10.9934 8.8882 2.9030 4.6427 9.0216 9.7664 3.3326 8.7756 1.2883 1.7216 8.8937 2.1080 1.5672 1.4514 2.3425 1.5721 1.6000 3.3102 3.4368 1.8579 1.9276 1.5746 1.3566 4.8195 1.1869 14.1519 9.4266 1.2284 4.5222 1.2737 5.0967 9.7316 10.2846 5.7035 4.1794 5.4984 3.7378 2.4640 10.7056 7.5492 7.5677 6.5681 8.1724 1.0891 1.0891 1.0961 1.0958 1.0934 1.0934 1.0930
irintensity: 0.0554 0.2537 0.0213 0.0104 0.4815 6.2881 6.0642 1.7656 3.6630 3.7775 0.8524 1.5710 0.2203 0.3052 1.9227 0.1726 1.6154 7.4988 0.1363 11.3643 0.8487 13.4665 5.4278 15.2233 10.0311 6.1463 0.7511 16.5535 34.7626 19.7613 38.5854 2.5050 0.0696 25.9094 34.1135 15.6201 7.3270 47.0055 8.3770 38.2287 5.1665 20.2033 35.7044 12.2466 13.4842 2.5594 19.0893 122.8707 24.5184 76.0443 10.0529 3.7758 34.9723 294.0132 229.8066 0.0860 220.0376 6.8374 11.7474 46.5300 148.8231 8.5709 29.3853 17.1818 12.8473 18.1189 147.9645 17.8222 89.8659 98.3937 11.7936 6.5247 0.1352 2.5282 5.8837 11.3247 2.0139 26.9343
temp: 298.150 k
press: 1.00000 atm
elementType: 17 8 8 8 8 8 7 7 6 6 6 6 6 6 6 6 6 6 6 6 6 1 1 1 1 1 1 1
symmnumber: 1
zpe: 472481.9 jmol-1
zpe.correction: 0.179959 hartree
zpe.thermalcorrener: 0.197683 hartree
zpe.thermalcorrenthalpy: 0.198627 hartree
zpe.thermalcorrgfe: 0.131319 hartree
zpe.sumelectzpe: -1443.634072 hartree
zpe.sumelectthermal: -1443.616348 hartree
zpe.sumelectthermalent: -1443.615403 hartree
zpe.sumelectthermalfe: -1443.682711 hartree
dipole: 4.0741 -0.0265 -0.3938
dipole: 4.0931
quadrupole: -146.9153 -151.1274 -122.4729
quadrupole: -4.9278 -0.8068 -4.3267
quadrupole: -6.7434 -10.9556 17.6990 -4.9278 -0.8068 -4.3267
hfenergy: -1443.8140305 hartree
pointgroup: C01 [X(C13H7Cl1N2O5)]
dipole: -1.5711709 -0.2384907 -0.2604056 debye
polarizability: 294.2773028|39.7471905|170.9372938|0.8494024|51.0789263|129.4065003 unknown
InChI: InChI=1S/C13H7ClN2O5/c14-10-3-1-8(2-4-10)13(17)9-5-11(15(18)19)7-12(6-9)16(20)21/h1-7H
charge 0 multiplicity 1
28 atoms
Cl -6.15863 -1.513579 -1.381278
O  -1.173685 1.658365 2.02071
O  3.322436 3.440795 0.877959
O  1.432267 -3.210012 -0.970841
O  4.893308 1.989293 0.080301
O  3.602666 -2.541814 -1.199939
N  3.689928 2.293493 0.424344
N  2.375347 -2.336541 -0.870935
C  0.324775 0.531261 0.535528
C  -1.064078 0.854097 1.045261
C  0.673737 -0.74026 0.021633
C  1.325572 1.524505 0.681697
C  -2.270137 0.230762 0.42078
C  2.643864 1.236056 0.287245
C  2.013717 -0.988866 -0.342149
C  3.024243 -0.018158 -0.228595
C  -2.299093 -0.221457 -0.927586
C  -3.458464 0.159385 1.200202
C  -3.48352 -0.746347 -1.484187
C  -4.642369 -0.375992 0.662617
C  -4.636124 -0.824566 -0.676335
H  -0.058321 -1.546873 -0.071504
H  1.07407 2.49972 1.108628
H  4.056247 -0.22742 -0.521217
H  -1.412798 -0.13328 -1.563838
H  -3.433837 0.53368 2.228504
H  -3.512363 -1.082988 -2.524114
H  -5.552957 -0.443461 1.264211
