program: Gaussian 09
title: 000257867
version: EM64L-G09RevD.01
frameworkgroup: C1[X(C17H15NO)]
method: RPBEPBE
basis: SDD
operation: Freq
keyword: #p
keyword: freq=noraman
keyword: PBEPBE/SDD
title: #p freq=noraman PBEPBE/SDD
converged: YES YES NO NO
title: Mulliken charges:
elementType: O N C C C C C C C C C C C C C C C C C H H H H H H H H H H H H H H H
charge: -0.265466 -0.026303 -0.279758 -0.377615 -0.548287 0.479993 0.614619 -0.417766 -0.410474 -0.430500 -0.411424 -0.352525 -0.361404 -0.377760 -0.390553 0.318604 0.389846 -0.262080 -0.537502 0.262377 0.248740 0.244292 0.246973 0.239858 0.237612 0.240051 0.237490 0.250147 0.240633 0.255128 0.254287 0.221593 0.220723 0.246451
chargesum: 0.00000
title: Mulliken charges with hydrogens summed into heavy atoms:
elementType: O N C C C C C C C C C C C C C C C C C
charge: -0.265466 -0.026303 -0.017381 -0.128875 -0.057022 0.479993 0.614619 -0.177907 -0.172862 -0.190449 -0.173934 -0.102379 -0.120771 -0.122631 -0.136266 0.318604 0.389846 -0.262080 0.151265
polarizability: 3.31787360e+02 2.10514695e+01 1.67547629e+02 1.73865515e+01 -8.06979801e+00 1.18890728e+02
1716.lowfreq: -11.3880 -5.5147 -3.9430 0.0007 0.0008 0.0009 7.0497 28.5018 42.6094
frequency: 2.6248 28.3796 42.5585 67.0667 78.9662 116.6460 118.6804 155.1214 185.1031 204.0779 233.6834 247.2294 284.3111 338.3651 369.1457 404.0381 413.9859 419.6073 436.7896 471.4621 486.8155 520.0529 548.2475 548.6469 569.3074 630.4300 641.3652 674.4119 684.5095 734.0548 745.8546 781.1201 793.0854 817.0285 824.2611 838.7393 846.9609 861.5730 905.5908 940.2741 945.4769 966.2450 970.0868 978.5186 986.5567 993.7161 1006.8762 1012.6004 1070.2953 1072.8395 1101.9069 1111.3683 1112.5883 1125.8769 1156.6767 1164.9740 1178.3726 1190.8037 1212.1662 1225.2141 1235.6400 1247.0406 1298.1268 1305.5252 1321.7521 1357.8572 1366.7323 1403.2641 1415.1495 1424.2587 1437.6950 1465.6366 1467.6366 1473.1932 1503.5898 1507.9031 1559.2873 1578.5343 1619.2415 1623.4863 2173.8072 2959.2265 3046.9302 3079.8596 3098.6765 3123.5411 3124.9564 3126.5065 3131.7648 3133.0450 3134.3924 3159.7654 3160.3705 3163.9919 3167.0191 3200.1772
redmass: 3.9381 6.3481 4.2173 3.9570 4.7572 5.4747 4.6326 6.5164 3.6533 3.3825 1.5238 2.7646 3.9941 4.9944 5.4258 2.8798 2.9556 3.9439 4.0907 5.3632 4.1026 3.0132 3.1363 7.0942 2.8661 6.7082 7.1786 3.4556 3.1760 3.3912 3.6225 4.0141 4.1912 1.3164 3.3250 1.4993 1.2882 1.9531 2.0535 2.1919 1.5973 1.3543 1.4027 1.4289 4.8106 2.4312 2.2218 2.4058 1.2369 1.0913 1.4989 1.3672 1.2660 1.4870 1.3299 2.4375 1.2766 1.5176 1.9129 2.1861 1.9746 1.6363 1.3074 1.6153 1.6793 4.1281 3.9848 2.7528 3.6821 2.3524 1.1784 1.2825 1.0499 1.0692 2.5919 2.7812 6.4045 7.3205 6.1482 6.4195 12.6296 1.0331 1.1039 1.0869 1.0576 1.0898 1.0942 1.0941 1.0884 1.0882 1.0886 1.0959 1.0942 1.0972 1.0958 1.1152
irintensity: 1.2016 1.3380 0.1115 0.5559 4.6684 1.1472 3.2599 2.8087 1.1910 1.9470 0.4306 1.2808 1.3813 0.4161 6.8174 0.1130 0.1624 3.0718 3.1218 0.7265 1.0043 15.8154 17.4844 0.7039 24.8414 0.4722 0.3058 9.0240 0.9275 2.6861 0.3772 4.7146 1.0616 16.2019 28.0674 66.8372 8.8311 27.6138 25.7074 22.9643 9.2123 0.1770 1.5083 1.2542 45.4386 5.0238 21.9263 0.7367 12.9816 10.9302 6.8884 13.0016 0.9448 13.5106 1.7547 11.7382 63.9961 19.1949 0.6924 179.2928 20.2045 18.3031 2.8673 5.3274 1.0674 6.7954 8.9399 37.2494 1.1853 10.9314 9.5840 39.2168 13.7589 51.0020 174.0007 25.6294 0.0930 7.3207 132.0384 32.6745 82.5977 67.8973 49.0191 10.4255 11.6926 15.1325 31.1937 2.1189 6.4219 19.9083 13.6502 13.4500 14.8427 0.4031 6.5451 15.0306
temp: 298.150 k
press: 1.00000 atm
elementType: 8 7 6 6 6 6 6 6 6 6 6 6 6 6 6 6 6 6 6 1 1 1 1 1 1 1 1 1 1 1 1 1 1 1
symmnumber: 1
zpe: 706926.7 jmol-1
zpe.correction: 0.269254 hartree
zpe.thermalcorrener: 0.286123 hartree
zpe.thermalcorrenthalpy: 0.287067 hartree
zpe.thermalcorrgfe: 0.220622 hartree
zpe.sumelectzpe: -785.402798 hartree
zpe.sumelectthermal: -785.385929 hartree
zpe.sumelectthermalent: -785.384984 hartree
zpe.sumelectthermalfe: -785.451430 hartree
dipole: 5.6568 0.1394 0.7258
dipole: 5.7048
quadrupole: -154.5254 -101.2885 -109.4116
quadrupole: -21.6540 -4.2583 -4.1869
quadrupole: -32.7836 20.4533 12.3302 -21.6540 -4.2583 -4.1869
hfenergy: -785.6720518 hartree
pointgroup: C01 [X(C17H15N1O1)]
dipole: 2.2265057 0.174491 0.2231536 debye
polarizability: 332.6003288|24.3360021|142.2675231|3.3439222|-25.395589|143.3578655 unknown
InChI: InChI=1S/C17H15NO/c1-19-15-8-6-14(7-9-15)17-10-16(17)13-4-2-12(11-18)3-5-13/h2-9,16-17H,10H2,1H3
charge 0 multiplicity 1
34 atoms
O  5.972098 -0.590941 0.482645
N  -7.021724 -1.356864 0.316062
C  0.535264 0.664479 -0.917721
C  -0.497807 1.134483 0.154083
C  0.015252 2.095437 -0.942525
C  1.948351 0.33621 -0.52117
C  -1.894233 0.615186 0.160241
C  3.036932 1.176832 -0.876476
C  2.230924 -0.854388 0.192483
C  -2.533044 0.32959 1.398859
C  -2.62598 0.377898 -1.038165
C  4.359127 0.843798 -0.528848
C  3.550838 -1.207352 0.550201
C  -3.84502 -0.174479 1.44835
C  -3.937302 -0.126937 -1.003015
C  4.621158 -0.351001 0.186771
C  -4.563396 -0.409988 0.243521
C  -5.905444 -0.926478 0.283411
C  6.297492 -1.815947 1.216703
H  0.102712 -0.009609 -1.670078
H  -0.070035 1.300818 1.149054
H  -0.688105 2.387273 -1.728126
H  0.684615 2.896703 -0.615107
H  2.844954 2.096841 -1.440343
H  1.404228 -1.516656 0.47735
H  -1.990226 0.506969 2.334569
H  -2.169217 0.591872 -2.01134
H  5.202229 1.485582 -0.80225
H  3.730204 -2.134502 1.102973
H  -4.321344 -0.387656 2.41061
H  -4.487557 -0.304503 -1.932559
H  5.996929 -2.718165 0.648998
H  5.816452 -1.828083 2.214281
H  7.390977 -1.798825 1.333058
