program: Gaussian 09
title: 000257859
version: EM64L-G09RevD.01
frameworkgroup: C1[X(C11H20O6S2)]
method: RPBEPBE
basis: SDD
operation: Freq
keyword: #p
keyword: freq=noraman
keyword: PBEPBE/SDD
title: #p freq=noraman PBEPBE/SDD
converged: YES YES NO NO
title: Mulliken charges:
elementType: S S O O O O O O C C C C C C C C C C C H H H H H H H H H H H H H H H H H H H H
charge: 1.083337 1.058504 -0.398557 -0.412002 -0.497161 -0.580564 -0.503714 -0.566770 -0.146606 -0.196013 -0.068879 -0.096743 -0.523371 -0.472601 -0.482194 -0.453748 -0.388577 -0.761660 -0.760088 0.253254 0.237941 0.275181 0.232356 0.230131 0.229606 0.214982 0.226878 0.231665 0.211917 0.235164 0.276523 0.239265 0.239477 0.285980 0.343621 0.278931 0.274618 0.287883 0.362034
chargesum: 0.00000
title: Mulliken charges with hydrogens summed into heavy atoms:
elementType: S S O O O O O O C C C C C C C C C C C
charge: 1.083337 1.058504 -0.398557 -0.412002 -0.497161 -0.580564 -0.503714 -0.566770 0.106648 0.041928 0.206302 0.135613 -0.063633 -0.030741 -0.038612 0.057939 0.090165 0.146872 0.164447
polarizability: 2.20621973e+02 4.67923093e-01 1.97194961e+02 -4.19969582e+00 -3.50666310e+00 1.50400315e+02
1716.lowfreq: -8.7765 -1.4220 -0.0011 -0.0005 0.0025 10.7877 37.6249 40.8386 63.0207
frequency: 37.5319 40.5500 62.9564 65.0652 78.7358 88.9002 100.2478 122.5677 146.4650 151.3833 176.2167 185.9971 194.3634 209.1006 226.8700 231.6784 241.4938 256.2953 279.0183 283.8983 303.3890 312.6665 343.1205 346.2962 360.4583 396.7588 422.4498 441.2775 458.1898 487.6982 509.6072 543.2087 573.6305 591.0070 604.0968 738.0388 742.7352 799.3710 811.0072 825.3194 834.1875 854.5766 879.1818 888.0656 904.7649 906.8832 916.8985 925.1936 926.7126 950.8911 960.6301 978.7318 993.3138 1003.9726 1010.6366 1018.6133 1046.2329 1055.8759 1057.8799 1065.7135 1095.4533 1114.1981 1126.6821 1149.8179 1161.5884 1183.0076 1199.4706 1205.8864 1228.3088 1237.8050 1261.6004 1278.0043 1281.7508 1292.3023 1302.3626 1312.3785 1329.6725 1333.4172 1336.1326 1343.6244 1350.1751 1371.2345 1416.5957 1418.4001 1434.1292 1438.9959 1453.3438 1462.1188 1472.1241 1479.4526 1498.7146 2973.8917 2980.2165 2982.5713 2994.2784 2997.2676 2998.1923 3006.6804 3007.1682 3014.8863 3041.8564 3046.3073 3052.2156 3055.4451 3071.8701 3074.6911 3078.3989 3148.1046 3153.9840 3184.0895 3189.4509
redmass: 4.5466 4.7874 7.4639 6.8543 4.1082 6.4382 8.0674 6.0245 4.4224 5.2788 4.5508 3.0908 3.5458 2.8225 1.2391 2.6493 1.4285 3.1916 2.5216 4.9419 3.3438 5.0679 8.8018 8.9631 5.8585 4.4440 4.0977 2.8548 2.5181 5.0024 3.4051 4.4327 3.6187 9.1368 9.3028 3.7026 3.5831 1.9405 1.7909 9.1335 11.9755 2.5826 3.8467 3.3999 2.3979 4.4399 4.4603 2.9838 3.7981 2.0029 1.6850 1.8396 1.4693 1.4422 1.3195 1.5562 2.1684 1.7742 1.6175 1.6206 1.7330 1.9716 1.3408 1.3596 1.9897 1.5339 1.1890 1.2297 1.2797 1.4448 1.3450 1.4315 1.4452 1.3752 1.4363 1.5136 1.1352 1.1306 1.2638 1.2774 1.3715 1.3907 1.0432 1.0432 1.0535 1.0527 1.0805 1.0733 1.0882 1.0872 1.0914 1.0589 1.0610 1.0836 1.0809 1.0596 1.0295 1.0592 1.0271 1.0630 1.1035 1.0930 1.1007 1.1037 1.1024 1.0945 1.1037 1.1041 1.1071 1.1072 1.1074
irintensity: 2.3004 0.2908 0.8072 0.6209 1.9508 4.2303 20.1187 0.7019 5.0396 11.5394 1.5151 2.5911 1.6719 1.4255 0.4432 5.4791 2.6155 1.8064 2.5129 2.0634 5.7224 10.6942 28.6454 11.6805 33.6961 11.5375 1.8561 38.4991 1.7618 32.1390 26.2751 47.9999 9.5171 30.8536 57.5467 1.6528 3.3915 0.2190 20.5390 31.5425 76.5709 29.4690 16.5229 9.9753 28.6777 124.8685 64.3078 3.2274 68.5935 2.9661 0.0881 6.2015 18.2621 7.3609 27.1850 6.8143 3.0941 42.9543 109.1588 7.1609 2.4220 3.3901 1.0965 2.2536 7.0937 0.6401 0.5718 4.1697 6.4515 6.9017 1.7930 0.2503 0.5420 5.1499 1.0712 1.8353 5.6745 13.8566 13.2529 9.0634 0.4601 5.5455 3.9407 4.2616 17.0431 10.8999 6.5297 12.2969 11.6954 14.8297 12.3338 8.7439 20.1788 4.1594 22.2088 35.6402 44.7042 31.1578 41.7064 59.1336 15.3474 36.1345 9.2186 49.9153 17.4957 19.0611 92.1080 29.5983 29.9096 1.1834 0.7829
temp: 298.150 k
press: 1.00000 atm
elementType: 16 16 8 8 8 8 8 8 6 6 6 6 6 6 6 6 6 6 6 1 1 1 1 1 1 1 1 1 1 1 1 1 1 1 1 1 1 1 1
symmnumber: 1
zpe: 805020.6 jmol-1
zpe.correction: 0.306616 hartree
zpe.thermalcorrener: 0.328081 hartree
zpe.thermalcorrenthalpy: 0.329025 hartree
zpe.thermalcorrgfe: 0.256501 hartree
zpe.sumelectzpe: -1676.758349 hartree
zpe.sumelectthermal: -1676.736884 hartree
zpe.sumelectthermalent: -1676.735940 hartree
zpe.sumelectthermalfe: -1676.808464 hartree
dipole: 1.8039 1.3772 0.4018
dipole: 2.3049
quadrupole: -116.4295 -154.4595 -128.7489
quadrupole: -8.8329 -5.5304 -13.8232
quadrupole: 16.7831 -21.2468 4.4637 -8.8329 -5.5304 -13.8232
hfenergy: -1677.0649648 hartree
pointgroup: C01 [X(C11H20O6S2)]
dipole: 0.6155271 -0.6393817 0.1860115 debye
polarizability: 198.1113164|-4.2155743|219.2668461|1.0429072|7.882816|150.8390868 unknown
InChI: InChI=1S/C11H20O6S2/c1-18(12,13)16-6-10-8-3-4-9(5-8)11(10)7-17-19(2,14)15/h8-11H,3-7H2,1-2H3
charge 0 multiplicity 1
39 atoms
S  -2.551218 2.269923 -0.170248
S  2.05754 1.945436 0.644339
O  -2.516205 0.388419 -0.188821
O  1.926878 0.634157 -0.672426
O  -4.031838 2.738108 -0.59892
O  -1.253486 2.825994 -0.985865
O  3.550198 1.971038 1.265787
O  0.808665 1.78655 1.677049
C  -1.133605 -2.270868 0.697371
C  0.850058 -3.046403 -0.127761
C  -0.498676 -0.999313 0.048778
C  0.818795 -1.557515 -0.616644
C  0.145404 -2.95803 1.259919
C  -1.575183 -3.291633 -0.393774
C  -0.208323 -3.835622 -0.956319
C  -1.365826 -0.197618 -0.925609
C  2.071179 -0.772248 -0.198235
C  -2.287362 2.539863 1.688423
C  1.755726 3.371729 -0.56045
H  -1.92222 -2.030979 1.428184
H  1.855784 -3.500959 -0.141984
H  -0.215033 -0.305953 0.866431
H  0.754005 -1.525835 -1.722374
H  0.683524 -2.339209 2.00053
H  -0.050307 -3.951433 1.701653
H  -2.209665 -2.836451 -1.173946
H  -2.167273 -4.103672 0.065506
H  -0.107844 -4.922025 -0.779755
H  -0.09368 -3.664146 -2.042157
H  -1.802086 -0.812957 -1.734114
H  -0.767966 0.614984 -1.386632
H  2.988995 -1.16571 -0.672729
H  2.205085 -0.79531 0.901631
H  -3.048387 1.924115 2.185787
H  -1.255674 2.208334 1.884949
H  -2.43422 3.615564 1.86196
H  1.919357 4.289843 0.02111
H  2.49164 3.241516 -1.36425
H  0.711345 3.249812 -0.891091
