program: Gaussian 09
title: 000257858
version: EM64L-G09RevD.01
frameworkgroup: C1[X(C11H20O6S2)]
method: RPBEPBE
basis: SDD
operation: Freq
keyword: #p
keyword: freq=noraman
keyword: PBEPBE/SDD
title: #p freq=noraman PBEPBE/SDD
converged: NO YES NO NO
title: Mulliken charges:
elementType: S S O O O O O O C C C C C C C C C C C H H H H H H H H H H H H H H H H H H H H
charge: 1.054647 1.054628 -0.430751 -0.430759 -0.517341 -0.509403 -0.509416 -0.517307 -0.161282 -0.161380 -0.090178 -0.089983 -0.547251 -0.484597 -0.484570 -0.360264 -0.360201 -0.729684 -0.729700 0.265025 0.265030 0.235175 0.235238 0.228287 0.233045 0.209279 0.231061 0.231068 0.209268 0.241876 0.230264 0.230271 0.241867 0.282737 0.287465 0.288812 0.287469 0.282746 0.288806
chargesum: 0.00000
title: Mulliken charges with hydrogens summed into heavy atoms:
elementType: S S O O O O O O C C C C C C C C C C C
charge: 1.054647 1.054628 -0.430751 -0.430759 -0.517341 -0.509403 -0.509416 -0.517307 0.103743 0.103650 0.144997 0.145255 -0.085918 -0.044257 -0.044234 0.111876 0.111937 0.129330 0.129322
polarizability: 2.38654737e+02 -1.05005787e-02 1.93249761e+02 7.06031552e-03 -2.34329353e-01 1.57594080e+02
1716.lowfreq: -3.9341 -0.0026 -0.0019 -0.0014 8.8098 9.5482 11.7134 15.9249 23.7719
frequency: 10.9323 15.8415 23.7598 25.1635 34.7262 60.3054 84.0870 84.4304 93.5172 134.1097 148.4515 149.5147 154.5328 155.4510 203.7058 215.5062 217.6212 258.4525 261.9267 277.2275 289.0954 300.5779 330.4606 350.5874 353.5406 368.1432 394.5210 431.9163 460.5180 492.9669 552.9161 559.1229 598.5363 601.8325 672.8325 735.5378 747.7282 796.7549 815.2639 830.5546 836.9245 844.1153 885.8483 904.6825 911.6656 911.7641 917.3006 925.1859 926.9695 932.3278 966.2035 978.4096 990.0120 996.3370 997.2789 1037.1853 1037.5557 1041.8832 1059.8574 1060.2951 1063.3771 1110.5129 1126.3536 1154.4068 1155.8041 1184.4378 1193.2179 1209.9662 1229.7986 1231.4953 1268.8019 1276.0500 1283.9152 1295.0750 1298.0937 1305.0098 1313.9591 1314.0916 1334.2318 1337.1127 1363.3263 1367.0510 1415.7116 1415.7252 1417.9593 1418.0273 1469.6853 1473.0485 1475.6052 1486.2696 1495.1989 2975.7571 2987.0627 2995.0864 3004.1805 3007.6975 3010.7673 3023.2979 3041.6155 3041.6419 3045.4965 3048.2156 3057.7390 3071.3188 3073.2084 3076.3373 3083.3776 3190.3693 3190.4074 3198.5665 3198.6231
redmass: 7.3971 5.3010 6.9327 8.5149 6.9829 3.3951 3.6725 4.1852 4.0628 3.2877 2.0639 5.6430 1.1048 1.3074 3.3266 4.8506 4.7476 2.5354 2.1173 5.1340 6.9275 7.7587 7.9315 5.6245 10.1207 5.7434 5.0818 2.5280 3.8333 2.5569 6.7934 5.9621 8.7132 9.1487 4.0712 3.0020 3.9905 1.8565 2.3717 2.9871 11.0801 3.6655 2.8109 3.2550 2.8034 2.8057 5.7359 1.9959 2.7199 3.0059 1.6022 1.9256 1.5203 1.3992 1.3917 1.9116 1.9934 1.6800 2.2163 1.3756 1.8459 1.2552 2.1010 1.3694 1.9010 1.4008 1.1979 1.4843 1.2556 1.3732 1.3642 1.5092 1.3230 1.4641 1.6440 1.3222 1.1347 1.1356 1.3755 1.3113 1.3584 1.2562 1.0520 1.0520 1.0505 1.0505 1.0808 1.0828 1.0894 1.0796 1.0973 1.0545 1.0546 1.0585 1.0846 1.0606 1.0620 1.0864 1.0248 1.0248 1.1088 1.1046 1.1081 1.1048 1.0876 1.1042 1.0929 1.1078 1.1078 1.1077 1.1077
irintensity: 0.4899 8.9372 0.0209 0.1672 1.1732 3.1875 1.6987 4.1091 8.1586 7.0591 1.3291 1.0915 0.5622 0.8848 0.0068 0.0118 3.4125 2.3500 5.3006 0.0208 0.0293 21.8560 0.7323 68.3065 33.0373 7.9864 36.5307 1.6439 5.7507 11.4323 57.3253 61.4705 101.1815 13.4454 19.8970 0.3259 8.5271 0.1008 13.1376 63.1249 0.0975 67.1736 0.8764 133.4830 32.2411 22.7988 11.1044 4.4034 84.0666 5.8272 0.1016 7.7558 0.0055 10.9346 67.9831 97.3665 11.0987 23.4539 1.9944 0.6777 2.5212 0.3172 15.2902 8.4378 5.1223 0.5010 0.3129 0.7030 2.6158 5.7845 1.1974 0.4290 3.0514 4.0659 0.7665 4.9731 4.3560 3.1426 3.0244 0.7137 0.0003 2.5562 2.6006 24.4599 11.9752 12.8606 0.6386 14.1824 12.1760 41.6243 3.1951 65.3106 5.8608 29.4184 13.7057 75.4885 28.0446 16.7937 0.0623 0.0530 0.3712 2.2162 38.1170 34.6162 45.5396 67.8794 17.9441 0.1305 0.1160 0.0085 0.0085
temp: 298.150 k
press: 1.00000 atm
elementType: 16 16 8 8 8 8 8 8 6 6 6 6 6 6 6 6 6 6 6 1 1 1 1 1 1 1 1 1 1 1 1 1 1 1 1 1 1 1 1
symmnumber: 1
zpe: 803044.5 jmol-1
zpe.correction: 0.305863 hartree
zpe.thermalcorrener: 0.328392 hartree
zpe.thermalcorrenthalpy: 0.329336 hartree
zpe.thermalcorrgfe: 0.249181 hartree
zpe.sumelectzpe: -1676.743595 hartree
zpe.sumelectthermal: -1676.721067 hartree
zpe.sumelectthermalent: -1676.720123 hartree
zpe.sumelectthermalfe: -1676.800278 hartree
dipole: 0.0075 6.2046 -3.8319
dipole: 7.2924
quadrupole: -92.1880 -147.5517 -137.6188
quadrupole: 0.1143 0.1769 3.3927
quadrupole: 33.5982 -21.7655 -11.8326 0.1143 0.1769 3.3927
hfenergy: -1677.0494588 hartree
pointgroup: C01 [X(C11H20O6S2)]
dipole: 0.0002766 2.4918451 -1.4220669 debye
polarizability: 238.6546029|0.0033604|193.2231624|-0.1052503|1.0012441|157.6208115 unknown
InChI: InChI=1S/C11H20O6S2/c1-18(12,13)16-6-10-8-3-4-9(5-8)11(10)7-17-19(2,14)15/h8-11H,3-7H2,1-2H3
charge 0 multiplicity 1
39 atoms
S  3.950784 -1.638644 0.091334
S  -3.950647 -1.640113 0.104345
O  2.905542 -0.118984 -0.228696
O  -2.906288 -0.122634 -0.228569
O  3.400366 -2.858795 -0.82194
O  4.156645 -1.851881 1.681886
O  -4.159092 -1.837724 1.696576
O  -3.397424 -2.868717 -0.795804
C  1.139614 2.164683 0.503764
C  -1.141669 2.163763 0.505223
C  0.797213 0.975761 -0.452817
C  -0.799544 0.975052 -0.451658
C  -0.000318 2.076166 1.557996
C  0.785964 3.494001 -0.227344
C  -0.790017 3.493361 -0.226363
C  1.453456 -0.346209 -0.015102
C  -1.454134 -0.347308 -0.012605
C  5.506963 -0.873249 -0.675291
C  -5.506294 -0.883994 -0.672488
H  2.172296 2.119798 0.883486
H  -2.173832 2.11806 0.886266
H  1.16311 1.186532 -1.475106
H  -1.166991 1.18522 -1.473523
H  0.000438 1.138154 2.142534
H  -0.000213 2.924268 2.265264
H  1.211258 3.529148 -1.246799
H  1.185264 4.361432 0.328717
H  -1.189349 4.360494 0.330137
H  -1.216608 3.528094 -1.245291
H  1.127605 -1.198016 -0.641596
H  1.268402 -0.571068 1.052945
H  -1.27003 -0.5698 1.05613
H  -1.126278 -1.199889 -0.636922
H  6.30092 -1.623589 -0.559481
H  5.259739 -0.672517 -1.725209
H  5.703965 0.043835 -0.105514
H  -5.257407 -0.693201 -1.723863
H  -6.299624 -1.634067 -0.550795
H  -5.705384 0.038375 -0.112028
