program: Gaussian 09
title: 000257849
version: EM64L-G09RevD.01
frameworkgroup: C1[X(C13H13N)]
method: RPBEPBE
basis: SDD
operation: Freq
keyword: #pfreq=noraman
keyword: PBEPBE/SDD
title: #p freq=noraman PBEPBE/SDD
converged: YES YES NO NO
title: Mulliken charges:
elementType: N C C C C C C C C C C C C C H H H H H H H H H H H H H
charge: -0.407456 0.486447 0.460862 0.407129 -0.418043 -0.416991 -0.312124 -0.386291 -0.435877 -0.424970 -0.381776 -0.284663 -0.292090 -0.634049 0.222031 0.225562 0.226668 0.237748 0.215790 0.235556 0.217093 0.302879 0.231078 0.229284 0.235735 0.235319 0.225149
chargesum: 0.00000
title: Mulliken charges with hydrogens summed into heavy atoms:
elementType: N C C C C C C C C C C C C C
charge: -0.104578 0.486447 0.460862 0.407129 -0.196012 -0.191430 -0.085456 -0.148544 -0.220086 -0.189413 -0.164683 -0.053585 -0.062806 0.062154
polarizability: 3.71793784e+02 5.12715912e+00 1.38924870e+02 -1.11184937e-01 -5.82849036e-01 6.34820264e+01
1716.lowfreq: -3.8675 -0.0006 -0.0005 -0.0005 6.7130 10.8413 20.5064 53.6758 101.5612
frequency: 19.7495 53.6605 101.5609 111.8763 153.1793 176.8905 196.0974 258.9890 271.4584 317.8549 389.9045 396.3743 430.5042 454.6180 516.7137 569.6184 571.8420 626.9306 634.7665 709.0335 732.3404 746.5672 767.5088 772.8510 802.0225 809.2597 826.0110 837.0089 890.8730 908.7101 909.3795 926.0076 956.4406 963.0664 994.1214 1016.1119 1069.2692 1080.3355 1089.3863 1118.5809 1122.2176 1163.6861 1167.9809 1197.4866 1248.2909 1287.2064 1298.1670 1327.2533 1346.1501 1359.6904 1411.0441 1439.5253 1450.0479 1467.5840 1468.3186 1476.1646 1501.7161 1532.3514 1539.1784 1566.7459 1612.9081 1641.0528 2951.8820 3017.8486 3069.1665 3099.0439 3112.6055 3117.6710 3159.0407 3159.3689 3168.8080 3185.3299 3193.7881 3213.7363 3582.2037
redmass: 3.5110 3.7893 4.0646 3.6421 1.9894 1.4876 3.4899 4.2216 3.9083 4.4860 1.4760 2.1237 2.7091 4.1915 2.2514 3.5817 3.2448 5.4989 1.9513 1.3749 4.3149 3.7271 1.7453 4.0971 5.8266 1.2787 1.7930 4.7967 1.2938 1.4057 2.4952 1.4194 1.4107 1.4526 2.8474 2.7126 2.3427 1.1859 1.1790 1.6011 1.2803 1.9641 1.5379 1.1447 2.1796 1.6316 1.4802 2.2515 1.8618 2.8278 1.8682 2.2561 1.4710 1.0468 4.4887 2.0249 1.1147 3.4478 4.7399 4.0282 6.9853 6.8633 1.0374 1.1012 1.0873 1.0964 1.0901 1.0890 1.0912 1.0897 1.0923 1.0943 1.1026 1.1034 1.0775
irintensity: 0.2080 1.8652 0.5583 1.3631 3.2951 0.0163 0.4006 1.0755 2.4369 0.5359 47.9146 50.9428 19.7556 1.6133 15.8320 24.0903 9.7710 7.6736 51.5445 2.3742 2.1063 0.6292 87.4488 4.7130 2.2187 2.9919 72.9370 17.6505 1.0160 1.4130 55.7758 21.2823 1.2325 8.1133 0.5811 28.1091 22.2519 24.8352 22.8853 10.0076 1.6756 1.3456 11.7141 122.9163 18.4334 2.1866 6.9652 58.4566 150.3436 20.5419 87.4623 8.1223 2.3560 14.0774 167.9059 25.4959 35.0929 255.3835 71.9702 4.3052 736.8076 103.9821 142.1469 46.2826 16.9135 25.4297 26.3095 7.2042 19.8599 7.5718 15.1411 1.3346 37.3289 21.2896 86.1054
temp: 298.150 k
press: 1.00000 atm
elementType: 7 6 6 6 6 6 6 6 6 6 6 6 6 6 1 1 1 1 1 1 1 1 1 1 1 1 1
symmnumber: 1
zpe: 579188.4 jmol-1
zpe.correction: 0.220601 hartree
zpe.thermalcorrener: 0.233209 hartree
zpe.thermalcorrenthalpy: 0.234154 hartree
zpe.thermalcorrgfe: 0.180510 hartree
zpe.sumelectzpe: -556.908117 hartree
zpe.sumelectthermal: -556.895508 hartree
zpe.sumelectthermalent: -556.894564 hartree
zpe.sumelectthermalfe: -556.948208 hartree
dipole: 6.4759 -0.4946 -0.0348
dipole: 6.4948
quadrupole: -64.2580 -71.4519 -91.2052
quadrupole: -3.8138 0.4095 0.1446
quadrupole: 11.3803 4.1865 -15.5668 -3.8138 0.4095 0.1446
hfenergy: -557.1287179 hartree
pointgroup: C01 [X(C13H13N1)]
dipole: -2.5490423 0.1685873 -0.057404 debye
polarizability: 369.8799647|-14.9585635|69.7822729|-18.3621619|-18.8518295|134.5384423 unknown
InChI: InChI=1S/C13H13N/c1-14-13-8-6-12(7-9-13)10-11-4-2-3-5-11/h2-10,14H,1H3
charge 0 multiplicity 1
27 atoms
N  -4.240903 0.534908 -0.521451
C  -0.110619 -0.053929 0.418616
C  -2.904901 0.337115 -0.195983
C  2.47638 -0.090175 0.1461
C  1.274159 -0.264165 0.820539
C  -1.125363 -0.142978 1.421533
C  -0.550844 0.217854 -0.917779
C  -2.485813 0.051382 1.13918
C  -1.9031 0.40598 -1.218055
C  3.776241 -0.438441 0.765952
C  2.789429 0.431184 -1.199809
C  4.783712 -0.161435 -0.140649
C  4.16637 0.390447 -1.363415
C  -5.335983 0.469327 0.444494
H  1.378973 -0.621026 1.85826
H  -0.825302 -0.36186 2.454446
H  0.176293 0.249084 -1.731933
H  -3.221951 -0.019253 1.945666
H  -2.208032 0.601767 -2.254443
H  3.882692 -0.857231 1.770025
H  2.078311 0.829005 -1.923402
H  -4.466224 0.730981 -1.495429
H  5.85575 -0.311569 0.007373
H  4.718924 0.723288 -2.246315
H  -5.223934 1.22832 1.244676
H  -5.401834 -0.52768 0.924474
H  -6.289331 0.660601 -0.074271
