program: Gaussian 09
title: 000257848
version: EM64L-G09RevD.01
frameworkgroup: C1[X(C18H21N2O2P)]
method: RPBEPBE
basis: SDD
operation: Freq
keyword: #p
keyword: freq=noraman
keyword: PBEPBE/SDD
title: #p freq=noraman PBEPBE/SDD
converged: YES YES NO NO
title: Mulliken charges:
elementType: P O O N N C C C C C C C C C C C C C C C C C C H H H H H H H H H H H H H H H H H H H H H
charge: 1.300268 -0.463505 -0.590915 -0.691580 -0.598568 -0.358271 -0.333120 -0.318430 0.473732 -0.624696 -0.363656 -0.382160 0.548601 -0.427810 -0.440388 -0.335902 -0.330895 0.498153 -0.395768 -0.410956 -0.237723 -0.239254 -0.249455 0.224400 0.232262 0.228258 0.204663 0.333175 0.240178 0.223176 0.234752 0.243868 0.266287 0.241012 0.305103 0.220645 0.226472 0.217622 0.211527 0.221896 0.223774 0.222657 0.223518 0.227054
chargesum: 0.00000
title: Mulliken charges with hydrogens summed into heavy atoms:
elementType: P O O N N C C C C C C C C C C C C C C C C C C
charge: 1.300268 -0.463505 -0.590915 -0.358405 -0.598568 0.098391 0.099800 0.144924 0.473732 0.120211 -0.122644 -0.077057 0.548601 -0.207165 -0.213916 -0.118280 -0.119368 0.498153 -0.173872 -0.187182 -0.015066 -0.015736 -0.022400
polarizability: 5.54268042e+02 -3.84625072e+00 2.14172022e+02 6.64396346e+00 4.12930977e+00 1.27034468e+02
1716.lowfreq: -6.9040 -0.0008 0.0002 0.0014 2.7119 10.3775 18.3609 22.9224 30.3227
frequency: 17.2364 22.7877 30.2022 38.3077 45.8513 67.6659 86.6138 114.2366 134.2041 150.0817 155.1513 181.0782 209.2392 241.0630 259.7706 271.3928 277.4003 290.6416 308.1035 328.6378 345.8182 382.4954 386.4376 404.3171 409.6684 412.6054 448.3867 466.1698 481.4138 493.7826 508.1407 543.5760 557.4681 586.7990 613.0396 616.0878 637.8539 676.6820 694.8043 736.0655 751.6985 768.9012 815.6338 817.7383 824.9192 838.7102 846.0524 860.5006 869.4582 883.9871 886.2759 909.0967 921.0406 946.9564 947.3686 972.9426 975.0952 984.4683 986.6247 994.7422 1003.3431 1024.1433 1025.7666 1037.5176 1065.2194 1082.5419 1110.4006 1111.3557 1112.5582 1133.3494 1171.2138 1186.5234 1190.0964 1191.6837 1200.8022 1206.8104 1216.7356 1247.8780 1262.7345 1281.5232 1296.9951 1307.3640 1327.9393 1338.6878 1339.8215 1343.0494 1350.5848 1374.2114 1387.3530 1405.5724 1432.8454 1439.4185 1440.6244 1441.4083 1466.0538 1478.9634 1481.9398 1483.4577 1492.1284 1511.7000 1561.0544 1580.2619 1604.4518 1622.6908 1645.2135 2940.6512 2976.8279 2989.5321 2999.4751 3046.6137 3062.7574 3068.4168 3084.4966 3093.5676 3095.0213 3114.8982 3116.5876 3121.3082 3123.3868 3133.4676 3136.5348 3146.8456 3163.2842 3168.0228 3174.8986 3511.9145
redmass: 4.4556 4.7466 3.5572 4.6015 5.0604 4.2589 3.9295 2.8528 5.3173 4.1457 4.4189 3.3890 6.6690 2.4752 1.4769 2.7431 2.7312 4.1794 3.6017 5.8156 2.7448 4.5111 3.8153 2.8276 3.3841 3.2414 4.7314 1.7926 4.2967 3.0001 4.7049 2.5349 2.5463 5.0447 7.2227 6.6375 7.0275 6.0491 1.7203 2.7462 3.5488 1.9818 1.7757 2.9146 3.0592 1.4367 1.3281 3.6873 4.2279 1.7219 1.7269 2.3266 1.6481 2.4333 1.4112 1.2490 1.3688 1.3169 6.0400 1.2783 3.0369 5.5666 2.2315 3.5800 4.5933 1.6309 2.0663 1.4939 2.0723 1.5603 1.0635 1.9074 1.1394 1.1249 1.7779 1.2362 1.3920 1.3317 1.1621 2.7137 3.0240 1.4761 1.1869 1.3806 1.3082 1.3064 1.3319 4.4574 5.3258 1.3630 2.0634 1.4636 1.1208 2.1142 1.0810 1.0525 1.0810 2.2593 1.0607 2.5335 6.4666 5.5950 5.7129 5.9708 5.4287 1.0686 1.0357 1.0658 1.0614 1.0942 1.1024 1.1010 1.0914 1.1017 1.0858 1.0865 1.0979 1.0901 1.0857 1.0884 1.0912 1.0956 1.1014 1.0945 1.0933 1.0757
irintensity: 0.1923 2.2293 0.4257 0.7121 0.1573 5.2421 0.4027 4.2473 1.9037 0.0969 3.7412 2.2943 10.4981 1.4994 0.7020 3.6135 2.6114 13.3750 2.1381 26.2503 11.9452 1.5388 6.4184 0.5160 13.5499 3.0451 29.8841 47.3642 39.6578 3.2490 27.4584 34.7526 12.0605 38.3838 58.4796 19.5493 7.7380 130.5407 50.5356 9.9017 79.0976 23.5965 25.7481 18.1341 124.1435 33.9451 23.2004 299.5844 99.4263 8.4198 10.5540 72.4587 0.1219 21.8093 5.8309 29.7519 7.7921 11.6144 1.1812 13.9398 8.2986 84.1158 20.0009 150.4875 102.9872 7.3489 35.4593 21.0686 37.2127 1.7688 0.0333 33.4887 0.9589 1.4334 38.7977 22.9116 15.8430 8.2761 5.0165 338.1169 79.3087 1.2742 60.4708 0.2209 7.4256 4.9635 9.2854 9.3185 2.4161 7.5930 5.8014 0.4961 14.9190 10.1890 6.9443 23.8018 6.3356 3.1233 62.7181 300.2618 2.4152 1.7756 156.5291 94.0536 0.3610 83.6073 46.8465 42.0211 35.3010 35.5295 25.9582 42.1362 0.0531 23.3397 47.9222 14.9915 5.6785 18.8848 1.6822 9.5577 11.7938 46.2209 43.0371 11.2378 15.2194 19.5502
temp: 298.150 k
press: 1.00000 atm
elementType: 15 8 8 7 7 6 6 6 6 6 6 6 6 6 6 6 6 6 6 6 6 6 6 1 1 1 1 1 1 1 1 1 1 1 1 1 1 1 1 1 1 1 1 1
symmnumber: 1
zpe: 931400.4 jmol-1
zpe.correction: 0.354752 hartree
zpe.thermalcorrener: 0.376637 hartree
zpe.thermalcorrenthalpy: 0.377582 hartree
zpe.thermalcorrgfe: 0.301321 hartree
zpe.sumelectzpe: -1297.990036 hartree
zpe.sumelectthermal: -1297.968150 hartree
zpe.sumelectthermalent: -1297.967206 hartree
zpe.sumelectthermalfe: -1298.043467 hartree
dipole: -5.2660 2.8355 -1.7291
dipole: 6.2258
quadrupole: -96.9311 -137.0662 -148.0620
quadrupole: -7.1269 6.6204 1.1659
quadrupole: 30.4220 -9.7131 -20.7089 -7.1269 6.6204 1.1659
hfenergy: -1298.3447877 hartree
pointgroup: C01 [X(C18H21N2O2P1)]
dipole: -2.0258386 -0.2757142 -1.3489114 debye
polarizability: 551.836799|28.1897226|146.7154744|17.2899826|-34.3335186|196.9222596 unknown
InChI: InChI=1S/C18H21N2O2P/c1-20(23(21)19-14-5-15-22-23)18-12-10-17(11-13-18)9-8-16-6-3-2-4-7-16/h2-4,6-13,19H,5,14-15H2,1H3
charge 0 multiplicity 1
44 atoms
P  -4.107055 -0.578731 0.315912
O  -4.975086 0.943178 0.346512
O  -3.682714 -1.132227 1.7504
N  -5.247412 -1.533156 -0.610662
N  -2.818528 -0.24896 -0.823047
C  -6.692012 -1.482144 -0.243289
C  -7.202408 -0.024564 -0.211267
C  -6.401516 0.840673 0.777139
C  -1.424229 -0.223082 -0.486842
C  -3.23895 0.286582 -2.140705
C  -0.499658 0.401463 -1.376679
C  -0.9093 -0.823229 0.698782
C  1.407622 -0.18508 0.079023
C  0.877971 0.413054 -1.098442
C  0.469668 -0.794764 0.961738
C  2.834462 -0.199629 0.42502
C  3.870182 0.313116 -0.313935
C  5.2981 0.300964 0.041032
C  5.806674 -0.264021 1.249385
C  6.23502 0.883454 -0.862948
C  7.185774 -0.2452 1.533956
C  7.616244 0.903082 -0.578548
C  8.10152 0.337957 0.623308
H  -6.881957 -1.96298 0.741733
H  -7.2468 -2.055474 -1.007275
H  -7.130364 0.417789 -1.221599
H  -8.268407 -0.024579 0.088828
H  -4.902657 -2.453782 -0.902355
H  -6.752946 1.884487 0.795312
H  -6.442153 0.426885 1.804843
H  -2.679337 -0.223759 -2.945033
H  -3.066661 1.377094 -2.206567
H  -4.311411 0.087297 -2.282724
H  -0.849263 0.890645 -2.288951
H  -1.589676 -1.291848 1.413916
H  1.547047 0.907945 -1.811293
H  0.835702 -1.26324 1.884244
H  3.064815 -0.680373 1.386997
H  3.64215 0.789486 -1.278656
H  5.119806 -0.719451 1.971311
H  5.866598 1.324502 -1.798035
H  7.552768 -0.685038 2.468581
H  8.313337 1.357799 -1.291614
H  9.173535 0.350757 0.849096
