program: Gaussian 09
title: 000257846
version: EM64L-G09RevD.01
frameworkgroup: C1[X(C20H21N)]
method: RPBEPBE
basis: SDD
operation: Freq
keyword: #pfreq=noraman
keyword: PBEPBE/SDD
title: #p freq=noraman PBEPBE/SDD
converged: YES YES NO NO
title: Mulliken charges:
elementType: N C C C C C C C C C C C C C C C C C C C C H H H H H H H H H H H H H H H H H H H H H
charge: -0.419883 -0.425090 -0.337420 0.096254 0.323551 -0.337950 0.329975 0.460473 0.489376 -0.418778 -0.381371 -0.458484 -0.386924 -0.457305 -0.392176 -0.324021 -0.422894 -0.431288 -0.686959 -0.253800 -0.242209 0.204154 0.206118 0.213582 0.214150 0.198034 0.198703 0.300883 0.215412 0.223179 0.244180 0.226946 0.216059 0.241737 0.225121 0.225565 0.240433 0.221577 0.211036 0.210864 0.219393 0.219802
chargesum: 0.00000
title: Mulliken charges with hydrogens summed into heavy atoms:
elementType: N C C C C C C C C C C C C C C C C C C C C
charge: -0.119000 -0.014819 0.090311 0.096254 0.323551 0.058786 0.329975 0.460473 0.489376 -0.203366 -0.158192 -0.214304 -0.159978 -0.241247 -0.150439 -0.098900 -0.197330 -0.190855 -0.043484 -0.034407 -0.022407
polarizability: 5.76690679e+02 4.41276155e+00 2.14115239e+02 -3.72030299e+00 2.96372457e-01 1.07632591e+02
1716.lowfreq: -10.8282 -2.7481 -0.0011 -0.0010 0.0014 0.7102 12.3141 23.8555 47.3131
frequency: 12.1813 23.7338 47.2283 49.0691 54.7281 85.3877 102.7011 119.7473 145.3328 152.2304 178.4501 198.7638 224.4105 230.5174 281.4533 302.4138 318.9454 357.4267 382.0821 394.5891 414.5245 426.5716 436.0264 489.7866 521.2734 542.5557 567.9177 572.1209 621.4322 637.0792 654.8969 716.2362 728.6361 737.5137 748.7894 759.0927 787.1834 797.2052 800.4421 807.7654 811.8408 825.1770 841.6947 853.8049 874.9226 906.3649 912.8028 919.6125 940.3299 943.6794 950.6445 958.1538 975.2638 994.0651 1016.5644 1022.6013 1029.8799 1075.3904 1078.5945 1090.8244 1113.9988 1122.2681 1144.5253 1153.9172 1166.6582 1195.3101 1197.8471 1207.4655 1220.8459 1255.9602 1263.9567 1280.2819 1283.2070 1290.7781 1298.8276 1320.1691 1328.9992 1348.4304 1358.5490 1371.6535 1391.5745 1393.3674 1416.2672 1441.2234 1446.0347 1457.0536 1468.5139 1473.6813 1476.8557 1478.0289 1486.3571 1500.2085 1505.6784 1527.7196 1564.1392 1589.2201 1611.3137 1612.6102 1640.3654 2932.3139 2962.7826 2970.7586 2975.9768 2976.9279 3009.2942 3037.9278 3072.1461 3073.5832 3078.4376 3113.0349 3114.7838 3118.2235 3123.5487 3137.6773 3157.4383 3159.1869 3172.3610 3179.3549 3215.1574 3559.8990
redmass: 4.1823 4.2317 2.9248 4.4551 1.8772 4.0313 3.6288 2.3778 3.6117 4.2103 3.8718 3.6284 1.2115 3.3531 4.0239 5.0180 3.8568 1.1843 3.1501 3.0240 2.9067 4.1212 3.0925 4.0132 2.2190 6.0519 3.2257 5.8192 6.4892 6.2519 2.5964 5.2099 2.9135 1.0786 2.5548 1.3268 4.5269 1.6552 1.3152 4.3374 1.2884 1.7017 5.0175 4.7218 1.4863 1.8084 1.4685 1.3592 1.4424 1.1661 1.4123 1.3900 1.3247 2.8491 2.5611 3.4111 2.4826 1.7590 2.2787 2.9008 1.3827 1.7780 2.0216 1.5588 1.0965 2.0481 1.1594 1.9088 1.3110 1.4386 1.5100 1.1489 2.1023 1.0655 1.5571 1.6899 1.6231 1.6602 2.8796 1.6150 2.6253 1.2382 2.3381 3.2760 2.8630 3.8119 1.0997 1.1698 1.6579 1.0424 1.0791 1.1145 4.4727 3.4273 4.1687 6.5950 6.7410 7.2424 6.8571 1.0571 1.0584 1.1029 1.0596 1.0361 1.1008 1.1044 1.0867 1.1010 1.0993 1.0897 1.0855 1.0887 1.0884 1.0942 1.1000 1.0939 1.0909 1.0936 1.1001 1.0769
irintensity: 0.0848 0.2367 0.2947 0.6154 0.5822 0.4243 0.2012 0.9818 2.0343 2.0308 0.5666 1.6257 0.5420 1.4720 0.5439 0.5148 5.6753 77.6498 6.9111 0.5199 0.8440 1.7478 15.4435 0.6341 32.2304 1.7267 1.5053 28.2265 9.2592 15.3953 0.3474 8.2388 8.8523 12.8090 6.9804 89.5858 6.3946 20.1198 2.1483 1.8295 9.3420 74.4308 11.2727 14.8949 1.3407 12.8372 21.2785 1.7991 5.4296 0.1513 1.2800 4.2495 0.0497 1.5590 24.4541 0.5118 24.2358 18.7949 2.3173 0.0272 24.2308 6.6679 31.0330 0.5533 11.3400 1.0435 167.2732 21.0343 0.0966 6.0803 19.5572 0.4082 3.1490 0.3478 28.2236 14.7244 89.6013 65.9471 96.7661 2.7889 2.1852 7.1395 31.8703 67.3871 8.9828 182.1310 20.2454 29.3801 80.2057 13.6382 18.8312 100.9192 1.5930 342.6300 7.4842 8.0345 258.9760 564.4164 143.9885 82.5585 9.6541 21.9807 60.8387 48.9316 2.9295 49.1833 14.7319 82.3445 50.4091 29.7411 4.1646 8.8643 1.5531 37.1847 67.9863 30.2344 8.8811 2.4763 13.4554 103.3221
temp: 298.150 k
press: 1.00000 atm
elementType: 7 6 6 6 6 6 6 6 6 6 6 6 6 6 6 6 6 6 6 6 6 1 1 1 1 1 1 1 1 1 1 1 1 1 1 1 1 1 1 1 1 1
symmnumber: 1
zpe: 921096.6 jmol-1
zpe.correction: 0.350827 hartree
zpe.thermalcorrener: 0.370296 hartree
zpe.thermalcorrenthalpy: 0.371240 hartree
zpe.thermalcorrgfe: 0.300253 hartree
zpe.sumelectzpe: -827.981780 hartree
zpe.sumelectthermal: -827.962312 hartree
zpe.sumelectthermalent: -827.961368 hartree
zpe.sumelectthermalfe: -828.032355 hartree
dipole: 6.8797 0.2560 -0.1128
dipole: 6.8854
quadrupole: -103.6986 -111.6523 -133.9214
quadrupole: 1.6214 -0.2789 -0.7826
quadrupole: 12.7255 4.7718 -17.4973 1.6214 -0.2789 -0.7826
hfenergy: -828.3326076 hartree
pointgroup: C01 [X(C20H21N1)]
dipole: 2.7083887 0.0334623 -0.0422318 debye
polarizability: 576.6897978|4.3062413|129.6135001|4.4382021|-43.0455963|192.1352106 unknown
InChI: InChI=1S/C20H21N/c1-2-3-14-21-19-12-8-16(9-13-19)15-18-11-10-17-6-4-5-7-20(17)18/h4-13,15,21H,2-3,14H2,1H3
charge 0 multiplicity 1
42 atoms
N  4.211278 0.264394 -0.520036
C  6.654021 0.223653 -0.101802
C  5.246032 0.025779 0.492741
C  -3.943895 -0.094528 0.170471
C  -2.553948 0.212827 -0.265141
C  7.770904 0.000664 0.942714
C  -4.846457 0.504033 -0.774991
C  2.846999 0.149055 -0.291269
C  -0.004914 -0.064074 0.128581
C  -1.425231 -0.196806 0.428102
C  -2.693119 1.018744 -1.493337
C  -4.036019 1.194082 -1.78774
C  -4.4481 -0.828988 1.261202
C  1.918845 0.3937 -1.35411
C  2.322376 -0.22781 0.98317
C  0.539308 0.292448 -1.148247
C  0.936187 -0.336059 1.169658
C  -6.242663 0.371178 -0.622372
C  9.18387 0.185503 0.349528
C  -5.852291 -0.958183 1.413772
C  -6.74098 -0.3644 0.48147
H  6.739079 1.250466 -0.513885
H  6.798019 -0.478769 -0.948402
H  5.157251 -1.007216 0.892985
H  5.107186 0.717505 1.351723
H  7.676974 -1.019567 1.366353
H  7.627814 0.705291 1.786512
H  4.52021 0.537626 -1.453124
H  -1.625227 -0.706659 1.383997
H  -1.869551 1.461431 -2.05292
H  -4.440626 1.766937 -2.62572
H  -3.777236 -1.300904 1.989325
H  2.301903 0.653578 -2.349493
H  2.998663 -0.436528 1.817431
H  -0.128771 0.448137 -1.998586
H  0.556721 -0.628242 2.157196
H  -6.932439 0.82568 -1.342939
H  9.964652 0.023585 1.114392
H  9.36564 -0.529293 -0.474784
H  9.314703 1.206546 -0.055418
H  -6.256487 -1.524004 2.260984
H  -7.822478 -0.479011 0.61811
