program: Gaussian 09
title: 000023298
version: EM64L-G09RevD.01
frameworkgroup: C1[X(C4H8ClNO)]
method: RPBEPBE
basis: SDD
operation: Freq
keyword: #p
keyword: freq=noraman
keyword: PBEPBE/SDD
title: #p freq=noraman PBEPBE/SDD
converged: YES YES NO NO
title: Mulliken charges:
elementType: Cl O N C C C C H H H H H H H H
charge: -0.068607 -0.180476 0.066718 -0.104252 -0.339805 -0.679322 -0.649115 0.249967 0.272984 0.236883 0.224642 0.256345 0.258610 0.244411 0.211017
chargesum: 0.00000
title: Mulliken charges with hydrogens summed into heavy atoms:
elementType: Cl O N C C C C
charge: -0.068607 -0.180476 0.066718 0.145715 -0.066821 0.038548 0.064923
polarizability: 7.16290894e+01 5.23971608e+00 6.15933053e+01 2.22054130e+00 1.77356986e+00 5.49537633e+01
1716.lowfreq: -7.9461 -0.0040 -0.0033 -0.0030 7.7537 10.3476 38.4046 73.5229 181.4312
frequency: 38.3928 73.5179 181.4293 192.9567 220.0587 243.1806 296.1271 322.1183 404.1003 455.3208 558.2790 585.6422 787.6986 852.9850 972.7595 1003.8178 1022.4170 1060.9926 1117.8826 1129.1350 1218.6347 1243.3349 1304.3363 1310.7400 1379.0996 1391.9798 1412.9044 1458.4838 1464.1029 1472.9393 1476.0444 2966.6171 2985.1607 2996.9828 3060.0620 3082.4774 3097.3353 3113.0183 3115.3844
redmass: 6.6151 5.8232 3.7435 1.7329 1.7094 1.0629 3.1934 3.6902 5.1695 3.3451 4.7184 4.2762 2.5101 2.0681 1.4220 2.0998 1.5072 1.9482 2.5630 1.5216 1.3485 1.2417 1.4617 1.4852 1.3457 1.2231 4.7489 1.0431 1.0641 1.0536 1.0487 1.0818 1.0396 1.0353 1.0881 1.0944 1.0999 1.1008 1.1009
irintensity: 0.8695 1.7288 0.0719 1.8898 2.0607 0.3225 1.0658 5.8776 5.6458 2.2204 4.4318 24.8185 32.7721 12.2984 16.0838 2.4232 22.0453 0.2030 7.5185 16.4795 16.5265 0.9690 19.1699 0.9363 18.5990 19.9150 56.0956 12.0808 18.7269 13.7775 10.7241 10.6308 17.9332 13.1060 7.9472 18.1499 15.5026 10.4058 18.9068
temp: 298.150 k
press: 1.00000 atm
elementType: 17 8 7 6 6 6 6 1 1 1 1 1 1 1 1
symmnumber: 1
zpe: 305457.2 jmol-1
zpe.correction: 0.116342 hartree
zpe.thermalcorrener: 0.125173 hartree
zpe.thermalcorrenthalpy: 0.126118 hartree
zpe.thermalcorrgfe: 0.081922 hartree
zpe.sumelectzpe: -746.608758 hartree
zpe.sumelectthermal: -746.599927 hartree
zpe.sumelectthermalent: -746.598983 hartree
zpe.sumelectthermalfe: -746.643179 hartree
dipole: -0.3968 0.0866 3.3856
dipole: 3.4099
quadrupole: -57.4324 -46.1977 -49.2755
quadrupole: -4.1624 1.2073 0.7974
quadrupole: -6.4639 4.7708 1.6931 -4.1624 1.2073 0.7974
hfenergy: -746.7251008 hartree
pointgroup: C01 [X(C4H8Cl1N1O1)]
dipole: -0.3073527 0.1497496 -1.2972471 debye
dipolederiv: -0.3623954 0.0717189 0.1650809 0.0764438 -0.3204133 -0.1333791 0.2105708 -0.1612566 -0.3933184 -0.6756831 0.2783342 -0.2426129 0.1572118 -0.2013197 0.0945995 0.1898485 -0.0233129 -0.179473 0.5903482 -0.4112282 0.2633203 -0.3811312 0.0361128 -0.2360322 0.1083073 -0.2512611 0.2252558 0.0088516 0.0924349 -0.0258231 0.2332012 -0.0685717 0.1700396 -0.1035984 0.1983146 -0.0966568 0.5111557 -0.0934419 -0.2163976 -0.1256817 0.361112 0.188839 -0.3280578 0.2510504 0.5262797 -0.0249896 -0.0002992 -0.0576272 -0.0709457 0.0379783 -0.0621378 -0.0874438 0.0363321 -0.0081417 -0.0515796 -0.0209319 0.0360919 -0.0232225 -0.1688073 -0.0013895 0.0446772 -0.0333027 -0.0167157 -0.0458258 0.0572676 0.0754296 0.0165181 0.0328744 -0.0655937 -0.0145027 -0.0401206 -0.0809854 -0.0274304 0.047615 -0.0069921 0.0456614 -0.002402 0.0430192 -0.0083099 0.029082 -0.0964012 -0.1086316 -0.0850884 0.0421975 -0.0230042 0.0382059 0.0061243 0.030775 0.0169906 0.1028999 0.0481069 0.0461403 -0.0929748 0.0765929 0.0153596 0.0694137 -0.0850694 0.0601358 0.0027371 0.1101707 0.027977 0.0534617 -0.0128192 0.0844964 -0.0157601 0.0374282 -0.0777488 -0.0384482 0.0785416 0.0324718 -0.0803487 0.0349852 0.0754168 0.024248 -0.073651 0.0681346 -0.0123217 -0.1076678 -0.0879347 -0.0186145 -0.0496287 0.0603701 -0.0056949 -0.011001 0.0012686 0.1167196 0.0570285 0.0449645 0.1058092 0.0458189 0.0195876 -0.076296 0.0900271 -0.074306 -0.0514299 unknown
polarizability: 70.5332326|-4.7646481|61.2084528|-4.6239281|3.2413967|56.4344727 unknown
InChI: InChI=1S/C4H8ClNO/c1-3(5)4(2)6-7/h3-4H,1-2H3
charge 0 multiplicity 1
15 atoms
Cl -2.016026 0.620777 0.965481
O  2.332058 -0.59265 0.321382
N  1.131867 -0.305087 0.620747
C  0.377412 0.351303 -0.550168
C  -1.088835 -0.113537 -0.53581
C  0.58418 1.876552 -0.405702
C  -1.257862 -1.634602 -0.502303
H  0.840435 0.001567 -1.498369
H  -1.616553 0.340588 -1.391204
H  1.643226 2.13415 -0.577045
H  -0.037169 2.40829 -1.148089
H  0.284641 2.217338 0.599002
H  -0.808785 -2.054937 0.413465
H  -2.323904 -1.911674 -0.530351
H  -0.756085 -2.089678 -1.378737
