program: Gaussian 09
title: 000257842
version: EM64L-G09RevD.01
frameworkgroup: C1[X(C21H24O2)]
method: RPBEPBE
basis: SDD
operation: Freq
keyword: #pfreq=noraman
keyword: PBEPBE/SDD
title: #p freq=noraman PBEPBE/SDD
converged: YES YES NO NO
title: Mulliken charges:
elementType: O O C C C C C C C C C C C C C C C C C C C C C H H H H H H H H H H H H H H H H H H H H H H H H
charge: -0.229564 -0.229720 -0.344668 -0.394616 -0.395219 -0.570622 -0.570373 0.516095 0.517253 -0.419630 -0.402862 -0.418018 -0.436187 -0.354865 -0.359571 -0.349451 -0.344511 0.293346 0.292822 0.122841 0.123477 -0.792090 -0.792231 0.196504 0.193341 0.217060 0.213711 0.215890 0.215276 0.210245 0.211284 0.211098 0.210684 0.237119 0.236257 0.235059 0.235819 0.275590 0.275496 0.239721 0.239793 0.236804 0.237227 0.260199 0.237105 0.236928 0.260156
chargesum: 0.00000
title: Mulliken charges with hydrogens summed into heavy atoms:
elementType: O O C C C C C C C C C C C C C C C C C C C C C
charge: -0.229564 -0.229720 0.045177 0.036155 0.035948 -0.149093 -0.148591 0.516095 0.517253 -0.182510 -0.166605 -0.182960 -0.200369 -0.079276 -0.084076 -0.109730 -0.104719 0.293346 0.292822 0.122841 0.123477 -0.057860 -0.058042
polarizability: 3.27304174e+02 -2.19446448e-01 1.87431452e+02 1.86528130e+00 -1.37029067e+01 2.13473142e+02
1716.lowfreq: -15.9214 -5.9907 -1.3698 -0.0007 0.0008 0.0012 13.4569 15.7787 17.4138
frequency: 13.0395 15.3471 17.3188 23.6161 32.5040 41.3512 66.3847 67.2108 90.3566 99.6829 118.5576 126.2247 142.5441 145.6804 148.6746 186.4254 189.5709 241.1942 292.5615 302.2790 332.6819 334.9277 362.0328 392.5789 400.1887 403.9082 404.7589 458.9449 461.3155 506.3893 520.1121 562.8087 570.6608 598.8363 599.4842 633.3171 633.4201 683.3728 690.2113 726.5214 748.7251 749.1105 753.3895 810.7952 813.6362 822.5476 842.9111 847.3638 865.8309 868.1277 931.4399 944.4502 947.1705 966.2348 968.1347 987.1224 998.7559 999.6569 1009.4743 1009.9095 1025.8380 1026.8589 1032.7459 1053.0431 1058.0515 1071.1651 1072.2519 1072.6266 1084.6166 1126.7363 1132.0899 1189.8564 1190.0217 1216.6748 1218.7191 1220.2877 1221.2850 1265.1315 1274.2295 1274.2835 1275.3036 1285.7173 1287.1434 1309.6929 1310.9411 1314.5844 1335.3552 1347.3381 1366.7289 1368.3952 1383.5546 1384.1317 1411.4613 1411.9323 1446.9181 1448.0926 1461.8422 1461.9156 1462.5055 1462.7864 1470.0809 1481.3327 1487.8131 1500.0302 1500.1611 1563.4076 1563.7985 1596.9157 1597.4264 1620.8243 1621.3971 2952.0806 2968.4784 2971.6459 2978.8843 2981.5187 2984.7316 2985.1419 2993.4991 3015.0500 3024.5508 3044.8256 3053.8013 3069.1866 3069.7736 3119.8311 3120.3783 3122.3982 3123.0107 3125.0910 3125.6238 3150.6205 3151.3309 3156.8599 3157.3079
redmass: 5.0990 3.6893 4.5311 4.3546 2.0957 5.5516 3.8455 4.0458 5.5533 2.3035 1.9900 5.5436 1.1105 2.7239 1.1698 3.7388 3.5564 5.3904 4.6142 4.5296 2.6313 2.6495 4.5213 3.5777 3.4295 2.8560 2.9100 3.8429 3.7247 3.7093 3.1823 4.5804 4.0982 2.3653 2.2939 6.8840 6.8808 4.1501 3.8243 1.0686 2.4469 3.6147 1.3692 4.2209 2.9163 1.2949 1.4850 1.5959 1.3683 1.4224 1.4318 2.1477 1.9908 1.4899 1.3628 3.4763 1.3786 1.4170 3.1280 3.0624 1.8168 1.8188 3.5369 3.3892 1.7928 2.4141 2.4607 2.4448 1.2478 1.2963 1.2005 1.1249 1.1253 1.2784 1.5625 2.1466 2.4888 1.2413 3.7237 1.4976 3.4945 1.0677 1.1473 1.3208 1.2926 1.4044 1.4236 1.5851 1.2750 1.2752 4.5365 4.4619 3.3118 3.3269 1.0946 1.0962 1.0501 1.0870 1.0666 1.0509 1.1021 1.1071 1.1035 2.6134 2.6125 6.5246 6.4589 7.4476 7.4922 6.6194 6.5826 1.0587 1.0587 1.0591 1.0595 1.0590 1.0375 1.0375 1.0983 1.1005 1.1027 1.1050 1.1047 1.0969 1.0969 1.0884 1.0888 1.0892 1.0893 1.0987 1.0989 1.0945 1.0944 1.0956 1.0955
irintensity: 1.4972 1.5050 2.3108 0.4684 0.4294 0.1544 4.7752 2.3755 0.2179 0.3360 0.0095 0.1902 0.4217 0.2908 0.3888 3.2956 6.0273 0.6123 0.1432 0.4526 0.7610 2.1621 0.3089 0.7559 3.6617 0.0833 0.2969 0.1169 6.3173 0.5940 14.1111 7.6989 21.5340 25.7413 20.1307 0.3482 0.5609 6.9160 1.7958 7.0390 0.0005 0.1330 0.1748 6.9985 9.2449 0.3468 42.5777 13.2462 26.9309 15.9203 2.5449 50.6777 16.9508 1.0962 0.2098 4.7195 1.7977 0.3569 3.3550 10.6303 0.9176 0.9511 1.0734 3.5606 1.5451 3.0538 0.9848 1.1511 0.0125 21.2878 0.5440 36.3434 26.0644 27.8794 0.8225 0.7664 17.7199 0.1008 347.8232 23.5642 115.2682 0.1258 0.6320 1.9043 5.7003 11.7715 0.8250 0.5756 54.3082 52.0694 17.0057 8.0667 22.7395 21.8269 30.0483 29.2381 20.8315 0.3056 0.4941 21.0599 0.1096 1.0837 22.0011 0.4869 0.5265 103.4089 50.0119 252.1873 48.8642 67.3445 10.7156 19.3502 0.3382 0.1042 1.5724 139.1133 3.6749 3.6659 4.8529 0.0224 0.6858 0.0648 114.1167 13.0506 13.1484 15.2008 12.4411 25.9144 19.8648 10.7305 12.3740 17.4549 19.2169 1.9135 2.5566
temp: 298.150 k
press: 1.00000 atm
elementType: 8 8 6 6 6 6 6 6 6 6 6 6 6 6 6 6 6 6 6 6 6 6 6 1 1 1 1 1 1 1 1 1 1 1 1 1 1 1 1 1 1 1 1 1 1 1 1
symmnumber: 1
zpe: 1024801.6 jmol-1
zpe.correction: 0.390326 hartree
zpe.thermalcorrener: 0.413851 hartree
zpe.thermalcorrenthalpy: 0.414795 hartree
zpe.thermalcorrgfe: 0.331200 hartree
zpe.sumelectzpe: -963.418707 hartree
zpe.sumelectthermal: -963.395182 hartree
zpe.sumelectthermalent: -963.394238 hartree
zpe.sumelectthermalfe: -963.477833 hartree
dipole: -0.3866 -3.2161 -0.4281
dipole: 3.2674
quadrupole: -192.4779 -141.0151 -130.3606
quadrupole: 9.3774 -42.5313 -2.5847
quadrupole: -37.8601 13.6028 24.2573 9.3774 -42.5313 -2.5847
hfenergy: -963.8090331 hartree
pointgroup: C01 [X(C21H24O2)]
dipole: 0.1558221 -1.2759977 0.0040304 debye
polarizability: 327.3257658|0.4700652|184.3835576|0.9542549|9.9554529|216.4994446 unknown
InChI: InChI=1S/C21H24O2/c1-16(22)20-12-8-18(9-13-20)6-4-3-5-7-19-10-14-21(15-11-19)17(2)23/h8-15H,3-7H2,1-2H3
charge 0 multiplicity 1
47 atoms
O  -8.006528 1.662867 -1.171854
O  7.797215 1.970114 1.172468
C  -0.006072 -1.873259 -0.000731
C  -1.297413 -1.025861 -0.01361
C  1.27768 -1.01441 -0.015319
C  -2.584035 -1.900342 0.017198
C  2.571818 -1.877985 0.002352
C  -3.85407 -1.066417 0.010124
C  3.835073 -1.033848 0.006508
C  -4.53277 -0.773922 -1.203986
C  4.333964 -0.47848 1.217072
C  -4.372104 -0.523314 1.215485
C  4.526724 -0.744838 -1.198414
C  -5.684589 0.033302 -1.214373
C  5.479565 0.335969 1.222642
C  -5.525548 0.286402 1.211907
C  5.676597 0.071567 -1.199699
C  -6.19856 0.577178 -0.005418
C  6.169392 0.62409 0.012506
C  -7.433035 1.431429 -0.065749
C  7.391461 1.496086 0.069439
C  -7.987995 2.017757 1.229731
C  8.139394 1.80342 -1.225283
H  -0.003854 -2.554409 -0.877437
H  -0.002399 -2.524632 0.898579
H  -1.316024 -0.382919 -0.916179
H  -1.303304 -0.340249 0.857446
H  1.285448 -0.365396 -0.913736
H  1.282523 -0.334558 0.860168
H  -2.552833 -2.538509 0.922458
H  -2.571272 -2.579868 -0.857083
H  2.563973 -2.547235 -0.879816
H  2.546767 -2.52722 0.90004
H  -4.151428 -1.190574 -2.144369
H  3.81742 -0.697486 2.15989
H  -3.867006 -0.744845 2.163827
H  4.160352 -1.169001 -2.141309
H  -6.215767 0.260244 -2.145013
H  5.872693 0.764615 2.150796
H  -5.902132 0.686687 2.159374
H  6.189643 0.272785 -2.146271
H  -7.237819 2.656628 1.731851
H  -8.269332 1.217014 1.939097
H  -8.878314 2.621103 0.997161
H  7.484126 2.322215 -1.949718
H  8.497336 0.874964 -1.707967
H  9.002538 2.446338 -0.996188
