program: Gaussian 09
title: 000257838
version: EM64L-G09RevD.01
frameworkgroup: C1[X(C17H20O2)]
method: RPBEPBE
basis: SDD
operation: Freq
keyword: #pfreq=noraman
keyword: PBEPBE/SDD
title: #p freq=noraman PBEPBE/SDD
converged: YES YES NO NO
title: Mulliken charges:
elementType: O O C C C C C C C C C C C C C C C C C H H H H H H H H H H H H H H H H H H H H
charge: -0.437227 -0.437240 -0.346181 -0.389235 -0.389325 -0.572570 -0.572480 0.516560 0.516460 -0.390489 -0.391080 -0.394467 -0.393853 -0.349421 -0.349314 -0.388031 -0.387979 0.276741 0.276558 0.192392 0.190321 0.210331 0.211420 0.210476 0.211321 0.205972 0.204188 0.205659 0.204488 0.232963 0.232847 0.231249 0.231343 0.247225 0.247259 0.215316 0.215335 0.351225 0.351244
chargesum: 0.00000
title: Mulliken charges with hydrogens summed into heavy atoms:
elementType: O O C C C C C C C C C C C C C C C C C
charge: -0.086001 -0.085996 0.036532 0.032516 0.032472 -0.162410 -0.162334 0.516560 0.516460 -0.157525 -0.158233 -0.163219 -0.162510 -0.102196 -0.102055 -0.172715 -0.172644 0.276741 0.276558
polarizability: 2.48402034e+02 -3.80158659e-01 1.41872354e+02 3.86058113e+00 -5.19353251e+00 1.79462339e+02
1716.lowfreq: -13.7516 -5.0943 -4.3913 0.0003 0.0008 0.0011 8.1053 10.3673 22.0609
frequency: 6.7397 9.9383 22.0057 30.2462 42.1662 58.5883 108.9570 119.0563 121.4812 146.6210 187.8616 292.0525 297.9820 299.3479 326.4299 342.8921 347.3023 373.8486 402.4666 402.7609 409.8090 410.0310 435.4493 484.5746 497.2142 541.4041 550.7473 636.6982 636.7536 715.7428 719.9039 728.1584 750.0013 752.5840 762.1482 806.0261 806.5329 821.0588 824.2717 825.3852 836.1692 841.7151 929.0921 929.5855 932.4518 958.8035 959.7020 989.1679 1003.9143 1004.4799 1034.9525 1051.3025 1058.5691 1072.4701 1075.7124 1113.6500 1122.4207 1143.0929 1144.1397 1178.1243 1178.4454 1214.6500 1215.4367 1218.9854 1220.3503 1245.1806 1245.3825 1267.0027 1275.5349 1284.7198 1287.6135 1316.2727 1319.7904 1320.4674 1338.4553 1347.9224 1390.6776 1390.8488 1425.4846 1425.6099 1462.4089 1463.2849 1470.7588 1481.8498 1488.4401 1504.0917 1504.6592 1598.0995 1598.1275 1627.3420 1627.4396 2947.9689 2964.4841 2967.3365 2974.2263 2977.4692 2988.3296 3008.9396 3017.6260 3038.8500 3048.8224 3106.6791 3106.9566 3122.1939 3122.4901 3133.3281 3133.7434 3167.5527 3167.7965 3582.4569 3582.8347
redmass: 3.6378 3.8682 6.4112 3.9736 2.0777 6.0674 2.1841 5.0062 2.0194 6.4031 4.9801 4.9475 2.8920 2.7127 4.2210 1.1177 1.1136 5.5348 3.1674 3.1942 2.9451 2.9451 3.7690 5.5733 3.3878 2.5246 3.2253 6.7425 6.7497 3.7538 3.6994 1.0693 4.2226 1.1655 3.7980 1.4714 1.4026 1.5042 3.6173 1.9085 1.7422 2.1538 1.3854 1.3799 1.3516 1.3701 1.3617 4.4830 2.8450 2.7744 3.4705 1.5181 5.3483 2.1982 1.3421 1.3401 1.1993 1.3680 1.3642 1.1100 1.1097 1.6972 2.1236 1.5257 1.4691 2.8972 2.9076 1.2561 1.4226 1.0673 1.1566 1.3752 1.2601 1.2906 1.4468 1.6093 6.0857 6.0343 2.8157 2.8174 1.0849 1.0661 1.0982 1.1032 1.1021 2.7806 2.7862 6.4364 6.4338 6.4839 6.4868 1.0587 1.0587 1.0591 1.0597 1.0589 1.0981 1.1002 1.1025 1.1051 1.1046 1.0873 1.0874 1.0898 1.0898 1.0961 1.0961 1.0952 1.0952 1.0660 1.0660
irintensity: 1.6100 1.1190 0.0171 0.0249 0.1770 0.0590 0.1413 0.7579 0.0081 0.0840 0.2865 0.0343 1.7909 4.9005 0.1634 138.5567 151.9402 1.7705 12.9412 8.1266 0.9122 2.4903 1.1742 0.3240 27.0971 50.2942 3.7468 0.8877 0.4951 3.7412 1.7076 6.7163 0.7105 0.2021 39.5774 8.1710 44.1725 0.6554 19.0650 0.6916 38.9781 35.0034 0.0656 0.1065 0.1408 0.1564 0.0887 0.7122 1.6031 6.7113 1.3838 11.6509 1.5269 1.7311 7.8996 77.9318 22.4539 266.9720 150.3819 8.9950 0.8124 0.6849 2.0331 25.6260 2.8720 24.6796 29.1556 0.0686 1.6967 0.0249 0.9709 2.2542 7.1973 15.1744 2.2621 0.0977 21.9566 6.0892 16.3577 10.3953 0.4877 0.0835 0.2268 0.1727 21.4508 156.9344 58.2853 6.0919 10.9347 26.4422 23.4791 18.6155 0.2177 0.5808 2.1488 160.8609 4.8603 0.0108 0.0346 0.0230 125.8916 22.1413 19.4216 19.5028 21.8541 15.3554 16.7283 7.5644 6.9665 38.5826 34.6344
temp: 298.150 k
press: 1.00000 atm
elementType: 8 8 6 6 6 6 6 6 6 6 6 6 6 6 6 6 6 6 6 1 1 1 1 1 1 1 1 1 1 1 1 1 1 1 1 1 1 1 1
symmnumber: 1
zpe: 851431.1 jmol-1
zpe.correction: 0.324293 hartree
zpe.thermalcorrener: 0.343081 hartree
zpe.thermalcorrenthalpy: 0.344026 hartree
zpe.thermalcorrgfe: 0.271427 hartree
zpe.sumelectzpe: -808.854961 hartree
zpe.sumelectthermal: -808.836173 hartree
zpe.sumelectthermalent: -808.835228 hartree
zpe.sumelectthermalfe: -808.907827 hartree
dipole: 0.0649 -0.4873 -0.0270
dipole: 0.4924
quadrupole: -120.5061 -116.1392 -100.4528
quadrupole: -2.5448 25.6241 -1.8250
quadrupole: -8.1401 -3.7731 11.9132 -2.5448 25.6241 -1.8250
hfenergy: -809.1792541 hartree
pointgroup: C01 [X(C17H20O2)]
dipole: 0.025399 0.1884641 0.0369497 debye
polarizability: 248.3571044|1.048418|144.02105|-4.1243019|-10.1615375|177.358572 unknown
InChI: InChI=1S/C17H20O2/c18-16-10-6-14(7-11-16)4-2-1-3-5-15-8-12-17(19)13-9-15/h6-13,18-19H,1-5H2
charge 0 multiplicity 1
39 atoms
O  -7.316132 -1.767316 -0.445134
O  7.31998 -1.78546 -0.335287
C  0.000946 1.449358 0.300547
C  -1.287347 0.623668 0.091457
C  1.289564 0.628903 0.073512
C  -2.581031 1.44856 0.340342
C  2.583116 1.461646 0.295514
C  -3.848785 0.626645 0.160939
C  3.851746 0.641571 0.113919
C  -4.467628 0.499208 -1.111438
C  4.424191 -0.070013 1.202178
C  -4.42518 -0.075069 1.249124
C  4.475546 0.524261 -1.15324
C  -5.614811 -0.297526 -1.299374
C  5.572143 -0.871106 1.040292
C  -5.574947 -0.878841 1.082533
C  5.626792 -0.273797 -1.337347
C  -6.167929 -0.988974 -0.197654
C  6.173173 -0.972951 -0.234945
H  -0.005771 2.323963 -0.384205
H  0.007512 1.864001 1.331044
H  -1.282595 -0.253438 0.770007
H  -1.30916 0.216673 -0.939675
H  1.29561 0.216346 -0.95568
H  1.300904 -0.244423 0.756768
H  -2.586956 2.313613 -0.352527
H  -2.540091 1.864528 1.366769
H  2.577943 2.317583 -0.408509
H  2.552505 1.89083 1.31689
H  -4.046614 1.03712 -1.969953
H  3.965499 0.008769 2.195705
H  -3.972722 0.009845 2.244894
H  4.059935 1.067425 -2.010963
H  -6.093815 -0.392321 -2.278546
H  6.01581 -1.415115 1.87959
H  -6.006236 -1.409262 1.94218
H  6.095006 -0.345654 -2.32826
H  -7.623797 -2.2091 0.384819
H  7.664832 -1.78995 -1.262485
