program: Gaussian 09
title: 000257827
version: EM64L-G09RevD.01
frameworkgroup: C1[X(C16H17NO)]
method: RPBEPBE
basis: SDD
operation: Freq
keyword: #p
keyword: freq=noraman
keyword: PBEPBE/SDD
title: #p freq=noraman PBEPBE/SDD
converged: YES YES NO NO
title: Mulliken charges:
elementType: O N C C C C C C C C C C C C C C C C H H H H H H H H H H H H H H H H H
charge: -0.231485 -0.696608 -0.583817 -0.591473 0.527757 0.532551 -0.421791 -0.404642 -0.398953 -0.397899 0.294959 -0.347650 -0.357673 -0.413376 -0.413263 0.480914 0.123372 -0.792452 0.224407 0.225315 0.220681 0.222684 0.235049 0.236491 0.224559 0.225497 0.238698 0.274741 0.212393 0.212795 0.236356 0.236945 0.259315 0.302919 0.302683
chargesum: 0.00000
title: Mulliken charges with hydrogens summed into heavy atoms:
elementType: O N C C C C C C C C C C C C C C C C
charge: -0.231485 -0.091005 -0.134096 -0.148108 0.527757 0.532551 -0.186741 -0.168151 -0.174394 -0.172402 0.294959 -0.108952 -0.082932 -0.200982 -0.200468 0.480914 0.123372 -0.059836
polarizability: 3.18845209e+02 1.84650546e+00 1.75546653e+02 1.94762713e+01 8.65781515e-01 9.11685666e+01
1716.lowfreq: -4.8544 -0.0006 0.0004 0.0007 0.7948 9.3622 18.1547 22.9386 32.5004
frequency: 17.8275 22.9307 32.4944 39.9585 65.8792 74.0136 136.8542 151.3329 173.0930 186.7720 281.8324 286.8665 335.1215 340.4833 351.8272 365.6181 377.5833 397.4597 404.4318 410.0352 454.7262 472.3179 514.4333 529.2690 570.8915 598.0116 632.7167 639.5281 681.8070 721.8583 741.0200 775.1813 784.0165 809.7015 816.6476 825.5137 834.0506 855.0517 872.6362 934.2844 944.2521 951.8153 965.8243 983.0814 991.4081 999.6954 1001.1587 1009.5308 1021.0027 1026.8992 1072.5649 1100.5575 1128.1512 1147.6806 1187.6161 1190.0193 1218.5761 1222.3328 1264.2984 1265.4810 1276.8666 1310.7489 1311.5441 1316.1599 1320.5657 1366.3991 1382.5968 1385.7414 1411.3578 1433.7546 1448.2479 1462.3666 1472.7918 1486.6761 1499.6681 1519.7313 1562.0910 1582.2490 1595.7300 1619.5567 1633.0480 1644.8738 2982.8971 2985.1146 2994.3646 3031.5653 3060.1912 3069.8116 3105.4881 3107.4567 3120.7536 3123.2819 3124.7554 3128.3381 3135.3744 3150.7673 3157.0800 3566.3600 3706.3487
redmass: 3.6018 4.6490 5.2479 3.2291 3.8301 6.0744 5.7061 1.0415 4.6415 3.5689 4.7073 2.3942 1.2239 2.9365 4.1929 1.0553 4.9116 2.5671 2.8421 2.6666 3.8058 3.9361 3.9314 2.6626 4.0090 2.3729 6.8961 6.6161 3.9057 3.5459 3.6390 4.0852 1.1932 2.3100 1.2609 3.8810 1.7777 1.6520 1.8149 1.4411 2.1502 1.3600 1.4287 1.6742 3.2342 1.5559 2.6030 3.0774 1.4187 1.8192 2.5176 1.3131 1.2399 1.1121 1.0975 1.1254 2.5224 2.2862 1.2675 1.4443 3.7321 2.0012 1.6088 1.4585 1.2563 1.2770 4.5958 5.4723 3.3500 3.2310 1.0987 1.0501 1.1108 1.1012 2.5909 3.1045 6.4400 6.6582 7.4207 6.5574 2.1521 1.8079 1.0591 1.0373 1.0597 1.1013 1.1049 1.0969 1.0867 1.0866 1.0885 1.0895 1.0984 1.0961 1.0971 1.0945 1.0956 1.0449 1.1040
irintensity: 1.0497 0.3089 0.0545 0.6591 2.2044 2.9418 0.2970 0.4417 2.8060 4.8582 2.8027 2.1225 301.8230 4.2471 10.2428 0.0851 7.8698 0.9688 0.0607 0.0448 1.9643 0.6202 11.6721 29.7580 21.3909 22.0161 0.5508 0.1965 3.5083 1.2834 1.8828 1.7559 0.3548 8.7201 0.0151 17.6729 91.2640 1.7209 15.1914 0.9254 38.6185 0.0773 1.0194 1.5081 6.8766 1.3633 0.0311 8.5028 0.1033 0.9342 1.4839 9.9608 0.8414 23.8799 31.6248 31.7691 2.3190 0.1961 3.1609 17.1445 270.9315 52.5383 9.7970 38.4338 0.7162 53.4637 11.5145 11.5230 23.0950 0.3704 32.3235 20.5797 1.5249 10.9724 0.5896 151.6344 90.4251 2.7341 176.5293 57.8587 0.6799 296.9701 8.5692 3.8038 57.1283 1.0664 25.0921 13.4750 2.6541 42.1189 14.1855 23.3825 9.3882 50.2484 4.6305 19.3276 1.9722 80.6006 19.5764
temp: 298.150 k
press: 1.00000 atm
elementType: 8 7 6 6 6 6 6 6 6 6 6 6 6 6 6 6 6 6 1 1 1 1 1 1 1 1 1 1 1 1 1 1 1 1 1
symmnumber: 1
zpe: 752455.5 jmol-1
zpe.correction: 0.286595 hartree
zpe.thermalcorrener: 0.303827 hartree
zpe.thermalcorrenthalpy: 0.304771 hartree
zpe.thermalcorrgfe: 0.238647 hartree
zpe.sumelectzpe: -748.603203 hartree
zpe.sumelectthermal: -748.585971 hartree
zpe.sumelectthermalent: -748.585027 hartree
zpe.sumelectthermalfe: -748.651151 hartree
dipole: 5.3531 2.6127 0.7371
dipole: 6.0020
quadrupole: -95.6310 -96.5800 -113.3319
quadrupole: -16.9326 2.5914 -0.9002
quadrupole: 6.2166 5.2676 -11.4843 -16.9326 2.5914 -0.9002
hfenergy: -748.889798 hartree
pointgroup: C01 [X(C16H17N1O1)]
dipole: 2.1111287 -1.0117866 -0.3091574 debye
polarizability: 318.568657|-0.7448886|175.5209939|-21.1394479|1.0481175|91.4707782 unknown
InChI: InChI=1S/C16H17NO/c1-12(18)15-8-4-13(5-9-15)2-3-14-6-10-16(17)11-7-14/h4-11H,2-3,17H2,1H3
charge 0 multiplicity 1
35 atoms
O  -6.029059 1.175161 0.357506
N  6.881336 -0.010148 -0.290294
C  0.371512 0.005133 -0.719152
C  1.16094 0.003755 0.635832
C  -1.131156 0.007324 -0.508275
C  2.666202 0.000233 0.427332
C  -1.855554 -1.209665 -0.408952
C  -1.845982 1.227579 -0.358771
C  3.391027 -1.213543 0.309051
C  3.395123 1.210451 0.297805
C  -3.95361 0.010358 -0.022319
C  -3.244824 -1.212317 -0.170398
C  -3.231502 1.231893 -0.120166
C  4.779768 -1.22821 0.072413
C  4.783833 1.218076 0.061058
C  5.502434 -0.006854 -0.057358
C  -5.432716 0.064013 0.226985
C  -6.213846 -1.244301 0.320113
H  0.68121 -0.883565 -1.300864
H  0.683039 0.894815 -1.29854
H  0.847355 -0.883422 1.219142
H  0.851144 0.892572 1.218594
H  -1.322105 -2.160847 -0.526943
H  -1.30398 2.177981 -0.438609
H  2.859553 -2.168769 0.411094
H  2.866937 2.168371 0.390875
H  -3.775573 -2.168217 -0.104149
H  -3.790319 2.167293 -0.008297
H  5.312707 -2.184126 -0.007507
H  5.319898 2.171419 -0.027895
H  -5.830219 -1.880862 1.139125
H  -6.129869 -1.824651 -0.617611
H  -7.273638 -1.015198 0.508063
H  7.397374 0.86034 -0.376085
H  7.39466 -0.882972 -0.3682
