program: Gaussian 09
title: 000257826
version: EM64L-G09RevD.01
frameworkgroup: C1[X(C16H15NO3)]
method: RPBEPBE
basis: SDD
operation: Freq
keyword: #p
keyword: freq=noraman
keyword: PBEPBE/SDD
title: #p freq=noraman PBEPBE/SDD
converged: YES YES NO NO
title: Mulliken charges:
elementType: O O O N C C C C C C C C C C C C C C C C H H H H H H H H H H H H H H H
charge: -0.225593 -0.209988 -0.209561 0.027817 -0.585889 -0.590938 0.526460 0.533712 -0.421672 -0.399831 -0.376997 -0.375426 0.294062 -0.345038 -0.355673 -0.356215 -0.356247 0.367611 0.127275 -0.790715 0.230203 0.231222 0.233459 0.235688 0.235655 0.236454 0.245296 0.246003 0.242197 0.278096 0.285363 0.285679 0.237074 0.238345 0.262117
chargesum: 0.00000
title: Mulliken charges with hydrogens summed into heavy atoms:
elementType: O O O N C C C C C C C C C C C C C C C C
charge: -0.225593 -0.209988 -0.209561 0.027817 -0.124465 -0.121792 0.526460 0.533712 -0.186017 -0.163377 -0.131701 -0.129424 0.294062 -0.102841 -0.077578 -0.070852 -0.070568 0.367611 0.127275 -0.053179
polarizability: 3.34981800e+02 -1.68187689e+00 1.87678122e+02 1.97063329e+01 -4.08974357e-01 9.12192302e+01
1716.lowfreq: -4.6062 -1.4777 -0.0003 0.0006 0.0008 7.7331 16.7537 19.8338 27.2577
frequency: 16.4765 19.7832 27.2396 35.8330 61.1102 66.9722 67.2191 130.0906 146.9278 153.1234 185.6873 210.6840 267.3560 319.3360 331.3981 341.4511 364.9530 388.1671 404.2139 408.5470 454.9451 492.1414 507.1567 514.2024 561.4005 595.7489 624.5684 627.6941 632.9467 668.2980 686.9499 732.9959 745.3981 769.6062 787.0531 809.7064 820.1264 849.3375 852.0659 867.3911 878.7354 945.0751 966.5238 983.3927 990.7698 994.2246 995.7074 1000.9989 1005.8128 1009.6983 1027.9352 1073.1559 1093.6546 1094.2669 1120.3818 1146.9583 1180.5167 1190.8963 1216.9283 1220.4016 1222.7295 1263.0387 1266.5107 1273.7432 1302.7291 1312.1240 1317.4569 1365.0125 1368.6673 1383.6388 1401.6060 1409.9570 1419.3277 1448.0019 1462.3477 1474.8178 1481.1228 1489.0199 1499.6075 1565.2727 1595.8316 1598.9136 1607.4700 1620.7445 2985.2503 2990.9556 3000.5609 3041.0217 3067.4592 3069.5244 3120.6026 3122.7465 3126.1087 3134.8805 3137.8042 3152.4780 3158.2203 3181.0729 3183.3951
redmass: 4.4085 5.6577 6.5330 3.7276 6.0323 5.6676 5.5597 7.0598 5.2001 1.0560 3.4426 5.2402 6.1321 2.5541 4.7794 5.3607 3.1302 5.3982 2.8496 2.8943 3.5509 4.0372 6.9088 3.1543 4.8087 2.4771 5.0872 6.8857 6.8894 4.6699 3.9368 5.0428 3.8489 6.1672 1.1888 5.3166 2.2430 1.4844 1.2498 1.4088 2.3121 2.1637 1.4534 1.6635 1.6213 1.9284 1.5564 1.4715 3.0426 3.0892 1.8178 2.5168 3.2464 1.3604 1.2866 1.1166 1.3257 1.1243 2.5746 2.4735 6.3330 1.2292 1.4727 3.6002 1.2789 1.2898 1.3828 7.5476 1.2776 4.8549 8.3921 3.1744 3.3428 1.0950 1.0498 1.2360 2.0460 1.1009 2.5674 6.5111 7.6658 7.4304 6.3646 6.6248 1.0375 1.0591 1.0596 1.1017 1.1050 1.0968 1.0888 1.0892 1.0989 1.0905 1.0907 1.0944 1.0954 1.0942 1.0953
irintensity: 0.9532 2.1319 1.7583 1.2141 1.2579 1.4913 1.4211 0.0711 1.3094 0.3896 4.4864 1.9833 0.1437 0.8307 1.3731 1.9239 1.4751 0.5024 0.0251 0.0027 0.9085 0.4616 0.8075 28.0514 20.3641 18.1504 2.9040 0.1773 0.5254 23.7227 12.5385 10.8581 0.1286 13.5272 0.2933 7.1268 4.8862 45.3980 0.6836 60.2175 1.3234 35.5140 0.4566 2.9498 0.8320 1.3793 0.9569 1.1275 7.6974 6.8232 0.8324 2.2596 18.2144 17.4000 0.2339 14.4723 76.1150 24.1993 0.0639 0.0847 379.9433 0.5334 34.9017 229.0602 0.1026 4.9991 0.0427 95.8337 53.7168 10.6708 0.1687 27.9210 41.6933 29.4739 21.3371 1.3106 9.7549 12.1879 0.4507 71.1164 3.3018 172.7663 75.7174 29.2672 3.5009 3.0243 45.1104 0.2941 20.9592 12.5403 11.6174 22.6881 12.9528 12.4062 9.0376 16.3188 1.8453 0.0122 4.0031
temp: 298.150 k
press: 1.00000 atm
elementType: 8 8 8 7 6 6 6 6 6 6 6 6 6 6 6 6 6 6 6 6 1 1 1 1 1 1 1 1 1 1 1 1 1 1 1
symmnumber: 1
zpe: 713597.0 jmol-1
zpe.correction: 0.271795 hartree
zpe.thermalcorrener: 0.290033 hartree
zpe.thermalcorrenthalpy: 0.290977 hartree
zpe.thermalcorrgfe: 0.221252 hartree
zpe.sumelectzpe: -897.630243 hartree
zpe.sumelectthermal: -897.612005 hartree
zpe.sumelectthermalent: -897.611060 hartree
zpe.sumelectthermalfe: -897.680785 hartree
dipole: 3.3512 2.5267 0.3065
dipole: 4.2081
quadrupole: -187.5729 -108.0943 -119.2603
quadrupole: 19.4494 -4.7811 0.8084
quadrupole: -49.2637 30.2149 19.0488 19.4494 -4.7811 0.8084
hfenergy: -897.9020373 hartree
pointgroup: C01 [X(C16H15N1O3)]
dipole: -1.3119387 -1.0024455 0.122223 debye
polarizability: 334.7359366|-0.6945021|187.6553705|-21.2608136|0.9440445|91.4878446 unknown
InChI: InChI=1S/C16H15NO3/c1-12(18)15-8-4-13(5-9-15)2-3-14-6-10-16(11-7-14)17(19)20/h4-11H,2-3H2,1H3
charge 0 multiplicity 1
35 atoms
O  -6.756419 1.17713 0.341638
O  6.763426 -1.156394 -0.25004
O  6.766151 1.124354 -0.301002
N  6.165389 -0.013145 -0.180896
C  -0.353803 -0.00239 -0.679932
C  0.411397 0.012714 0.688265
C  -1.860362 0.0007 -0.484284
C  1.916687 0.006982 0.493826
C  -2.587869 -1.215516 -0.416164
C  -2.570582 1.221695 -0.325715
C  2.632119 -1.217754 0.406845
C  2.634869 1.225026 0.351873
C  -4.685661 0.006077 -0.03744
C  -3.980904 -1.216684 -0.196769
C  -3.959417 1.226675 -0.105733
C  4.022321 -1.23706 0.185587
C  4.025109 1.231024 0.130176
C  4.701154 -0.00626 0.049047
C  -6.170704 0.063853 0.194767
C  -6.959939 -1.240717 0.248203
H  -0.039575 -0.897388 -1.249075
H  -0.03931 0.881287 -1.266874
H  0.094281 -0.868723 1.276143
H  0.098054 0.909515 1.254577
H  -2.057586 -2.167198 -0.544635
H  -2.026023 2.172298 -0.385421
H  2.092787 -2.165108 0.521961
H  2.097803 2.177886 0.424247
H  -4.515954 -2.171351 -0.15443
H  -4.516761 2.161958 0.013435
H  4.586663 -2.171124 0.121293
H  4.591498 2.1600 0.024023
H  -6.592754 -1.895917 1.060172
H  -6.863432 -1.801989 -0.699913
H  -8.021449 -1.010558 0.423948
