program: Gaussian 09
title: 000257824
version: EM64L-G09RevD.01
frameworkgroup: C1[X(C18H21NO)]
method: RPBEPBE
basis: SDD
operation: Freq
keyword: #p
keyword: freq=noraman
keyword: PBEPBE/SDD
title: #p freq=noraman PBEPBE/SDD
converged: YES YES NO NO
title: Mulliken charges:
elementType: O N C C C C C C C C C C C C C C C C C C H H H H H H H H H H H H H H H H H H H H H
charge: -0.258248 -0.446712 -0.366375 -0.371113 -0.579271 -0.570266 0.529434 0.505421 -0.413376 -0.409133 -0.416757 -0.412117 0.466308 -0.447954 -0.355096 -0.228713 -0.229661 -0.244518 0.217174 -0.782428 0.208116 0.210159 0.209823 0.209869 0.209454 0.206950 0.207668 0.206810 0.233129 0.232343 0.230358 0.230977 0.213753 0.306690 0.222118 0.222497 0.226404 0.299273 0.257671 0.258074 0.211267
chargesum: 0.00000
title: Mulliken charges with hydrogens summed into heavy atoms:
elementType: O N C C C C C C C C C C C C C C C C C C
charge: -0.258248 -0.147439 0.051901 0.048579 -0.162867 -0.155788 0.529434 0.505421 -0.180247 -0.176790 -0.186399 -0.181140 0.466308 -0.234202 -0.048407 -0.006595 -0.007163 -0.018113 0.217174 -0.055417
polarizability: 3.21725964e+02 1.13235035e+01 1.92606321e+02 3.12643648e+01 -1.26009005e+01 1.17671110e+02
1716.lowfreq: -5.9756 -4.2089 -0.0009 -0.0004 0.0008 2.8669 11.2012 18.6936 23.5743
frequency: 10.4268 16.3181 23.5706 27.3466 50.1534 59.2941 67.1522 90.6623 97.9670 114.1112 153.3137 175.8512 187.3623 282.9586 295.0906 305.5143 336.6647 360.3718 375.4683 403.0506 408.1531 412.8172 494.4195 515.7243 540.2336 584.0457 596.6355 617.5871 625.8700 640.0104 640.4555 705.6451 734.4444 738.7963 758.2448 782.9136 788.8875 808.5357 828.1566 837.7105 852.9735 866.3491 893.5669 916.1382 932.4123 946.2258 975.1324 989.6401 991.6759 991.9461 992.5391 1002.1697 1010.3143 1026.7799 1037.7484 1039.2469 1042.5228 1060.3632 1073.7520 1109.0826 1132.7744 1171.2264 1186.0267 1189.1488 1214.8223 1215.2999 1218.3525 1229.1747 1233.8560 1262.6134 1281.1585 1282.2850 1294.4083 1314.9049 1327.2429 1331.6343 1343.5852 1375.3984 1382.1680 1388.3325 1409.6667 1439.9427 1448.6874 1466.2027 1467.6644 1469.0123 1479.3859 1483.4418 1490.0789 1494.9372 1509.8278 1592.5683 1592.7136 1614.1460 1623.1929 1627.0219 2964.1895 2968.1637 2976.2477 2981.1078 2993.8615 3003.0148 3018.2457 3037.0041 3052.2246 3094.5379 3098.6187 3102.4944 3112.5686 3113.2262 3121.1138 3130.0148 3133.5078 3141.2588 3160.7069 3192.2705 3533.5698
redmass: 4.5140 3.8123 4.4893 3.4645 1.3435 2.8867 4.6355 3.8104 2.6064 1.8106 3.9206 4.5152 4.4444 4.1474 4.3249 3.5601 2.3446 3.7002 3.1826 2.8206 2.9536 4.1722 3.5705 3.2940 2.8449 4.1654 3.2121 6.3561 5.1182 1.3898 3.2706 1.7320 3.3807 1.1039 2.0444 1.2538 3.2634 3.8127 1.5765 3.9259 1.2478 1.4805 1.3742 1.4593 6.1400 1.3869 1.3867 5.9006 1.3906 1.6105 1.3360 3.8056 2.6879 2.1797 1.5937 1.6292 5.3465 2.5362 1.3906 1.2758 1.2152 1.0518 1.1126 1.1331 2.3242 3.3180 2.0512 1.4059 1.4091 1.9511 1.2098 1.0842 1.4519 1.4240 1.2526 1.4302 1.5412 4.1358 7.8535 1.2298 3.5156 2.1794 1.0454 1.0742 1.1035 1.0954 1.1333 2.1687 1.1031 2.0932 2.9277 5.9365 6.0427 6.1779 4.7716 6.3834 1.0590 1.0590 1.0597 1.0589 1.0363 1.0984 1.1015 1.1043 1.1048 1.1000 1.0983 1.0877 1.0868 1.0869 1.0908 1.0907 1.0959 1.0958 1.1014 1.0945 1.0764
irintensity: 0.6886 1.4661 0.6702 0.2274 0.6646 0.3157 8.4227 0.2561 0.4908 0.1917 5.6831 0.9875 1.5765 0.7615 1.6394 0.5846 0.1774 1.8775 0.2045 0.0006 0.0120 0.9589 17.4299 6.5446 27.6330 13.4106 1.2081 0.0657 4.3626 52.2792 8.4573 54.1216 0.4220 4.3010 46.4901 0.1211 1.2890 0.4766 40.3104 0.6295 0.0063 40.2099 0.1330 3.5897 5.6606 0.8746 0.0284 0.1298 2.8478 11.9685 0.7160 0.0433 5.8128 9.7204 1.0445 14.8415 0.4129 0.0053 7.9404 2.2525 18.7498 0.0997 0.1428 0.7972 1.3021 34.9658 14.5114 19.5422 0.1027 34.8365 0.5282 0.2020 0.1331 54.2578 0.1410 5.7712 0.6206 129.7458 0.1460 60.1289 30.2336 6.4184 15.1097 0.0375 0.9693 21.6493 1.0291 23.6132 19.8592 120.1542 341.6291 52.7233 0.6955 13.8297 124.6269 25.1306 0.1159 1.1519 6.8757 130.5787 15.4900 0.0756 0.3220 0.2441 89.6398 19.0427 9.5491 24.4493 10.0659 8.8905 22.1240 10.7416 16.2638 48.4484 27.2306 5.2893 10.8980
temp: 298.150 k
press: 1.00000 atm
elementType: 8 7 6 6 6 6 6 6 6 6 6 6 6 6 6 6 6 6 6 6 1 1 1 1 1 1 1 1 1 1 1 1 1 1 1 1 1 1 1 1 1
symmnumber: 1
zpe: 901705.4 jmol-1
zpe.correction: 0.343441 hartree
zpe.thermalcorrener: 0.363053 hartree
zpe.thermalcorrenthalpy: 0.363997 hartree
zpe.thermalcorrgfe: 0.289917 hartree
zpe.sumelectzpe: -827.059930 hartree
zpe.sumelectthermal: -827.040318 hartree
zpe.sumelectthermalent: -827.039374 hartree
zpe.sumelectthermalfe: -827.113454 hartree
dipole: -0.5932 3.6553 -0.6073
dipole: 3.7526
quadrupole: -105.8223 -114.5337 -124.3015
quadrupole: -21.7074 9.2665 -4.2129
quadrupole: 9.0636 0.3521 -9.4157 -21.7074 9.2665 -4.2129
hfenergy: -827.4033714 hartree
pointgroup: C01 [X(C18H21N1O1)]
dipole: 0.2298504 -1.4353702 -0.2580636 debye
polarizability: 321.2683563|11.6619238|192.2646285|-32.6502234|13.450899|118.4704103 unknown
InChI: InChI=1S/C18H21NO/c1-15(20)19-18-13-11-17(12-14-18)10-6-5-9-16-7-3-2-4-8-16/h2-4,7-8,11-14,19H,5-6,9-10H2,1H3
charge 0 multiplicity 1
41 atoms
O  6.25313 1.795252 -0.209761
N  5.615716 -0.462452 -0.344112
C  -0.904007 -0.139367 -0.062021
C  -2.405739 -0.142467 0.29588
C  0.003796 -0.486105 1.1516
C  -3.31118 0.21593 -0.916096
C  1.483156 -0.47158 0.79856
C  -4.790136 0.218007 -0.558014
C  2.167555 -1.661921 0.442986
C  2.216854 0.741855 0.768694
C  -5.573736 -0.957897 -0.689663
C  -5.410603 1.384866 -0.040145
C  4.242853 -0.412587 0.042113
C  3.525632 -1.63838 0.070017
C  3.576793 0.790404 0.398562
C  -6.936034 -0.970894 -0.31321
C  -6.7723 1.378264 0.337683
C  -7.540856 0.198492 0.203393
C  6.532982 0.584009 -0.453888
C  7.932674 0.158129 -0.897282
H  -0.710705 -0.864487 -0.878576
H  -0.615555 0.856032 -0.456778
H  -2.596667 0.578817 1.116371
H  -2.697946 -1.139104 0.684661
H  -0.201163 0.241661 1.961816
H  -0.286288 -1.483002 1.537835
H  -3.009522 1.211562 -1.297233
H  -3.11655 -0.510848 -1.729289
H  1.632294 -2.619137 0.461939
H  1.714687 1.677053 1.047241
H  -5.1127 -1.867679 -1.095169
H  -4.822154 2.305826 0.061051
H  4.03321 -2.575246 -0.196808
H  4.129951 1.73101 0.3830
H  -7.52562 -1.888104 -0.426191
H  -7.234664 2.290934 0.731267
H  -8.597752 0.192026 0.49302
H  5.967901 -1.394867 -0.571248
H  8.657598 0.442221 -0.114858
H  8.203286 0.716039 -1.810109
H  8.033209 -0.922971 -1.098238
