program: Gaussian 09
title: 000257819
version: EM64L-G09RevD.01
frameworkgroup: C1[X(C20H24N2O2)]
method: RPBEPBE
basis: SDD
operation: Freq
keyword: #p
keyword: freq=noraman
keyword: PBEPBE/SDD
title: #p freq=noraman PBEPBE/SDD
converged: NO YES NO NO
title: Mulliken charges:
elementType: O O N N C C C C C C C C C C C C C C C C C C C C H H H H H H H H H H H H H H H H H H H H H H H H
charge: -0.258445 -0.258461 -0.437617 -0.437634 -0.367008 -0.366906 -0.579464 -0.579527 0.526249 0.526245 -0.414925 -0.414908 -0.404442 -0.404446 -0.357397 -0.357388 -0.451096 -0.451104 0.473351 0.473343 0.208729 0.208757 -0.800711 -0.800700 0.206376 0.211573 0.206379 0.211570 0.211020 0.204971 0.211034 0.204949 0.232930 0.232935 0.231941 0.231938 0.305544 0.305563 0.212739 0.212742 0.305994 0.305990 0.235611 0.268620 0.235429 0.235615 0.268618 0.235425
chargesum: 0.00000
title: Mulliken charges with hydrogens summed into heavy atoms:
elementType: O O N N C C C C C C C C C C C C C C C C C C C C
charge: -0.258445 -0.258461 -0.131623 -0.131644 0.050942 0.051042 -0.163473 -0.163544 0.526249 0.526245 -0.181995 -0.181973 -0.172501 -0.172508 -0.051853 -0.051825 -0.238357 -0.238362 0.473351 0.473343 0.208729 0.208757 -0.061050 -0.061042
polarizability: 4.05136410e+02 2.80932713e-02 2.25340697e+02 -3.79335893e+01 6.10866489e-02 1.33822481e+02
1716.lowfreq: -57.1459 -57.0597 -0.0010 -0.0006 0.0006 1.8046 5.1124 10.8893 17.6137
frequency: -57.0567 -56.9505 10.8834 20.1023 24.8525 30.3836 39.2412 71.4832 71.9086 80.7444 85.5490 101.6444 110.4940 149.6768 152.3725 168.3713 168.6431 262.6567 268.1346 290.0926 294.0839 323.9336 346.0599 372.7730 375.6849 405.7291 409.6681 410.0553 419.3791 501.0192 509.4329 539.1246 554.5912 583.1271 583.3775 626.3240 627.3867 637.0124 637.0865 642.5273 642.7747 734.1528 735.0984 739.0137 779.3264 784.9279 787.3086 825.5930 826.4905 835.3676 835.4478 862.5507 868.3924 895.4424 927.9970 929.3781 944.5841 945.4830 985.0101 985.0981 989.7990 989.9412 1002.8891 1009.0036 1011.9216 1030.0407 1030.0516 1044.1252 1048.2056 1064.4095 1091.6590 1129.2085 1138.1291 1190.7511 1191.0272 1215.0900 1215.2392 1221.4472 1221.5921 1234.5335 1237.2570 1262.4809 1262.5382 1281.6265 1285.3858 1300.2215 1315.1366 1316.4491 1336.2241 1348.4378 1373.4729 1373.5610 1375.9845 1376.4356 1407.5610 1407.6586 1448.8696 1448.9262 1465.6595 1466.7656 1468.9512 1468.9566 1478.9219 1489.0753 1498.0771 1498.2274 1509.4478 1511.0011 1592.4651 1592.6132 1625.2222 1625.3562 1633.7619 1634.0160 2962.1747 2966.1590 2975.3408 2979.7069 2984.6997 2984.7055 3001.5707 3016.8029 3035.9568 3050.9903 3070.0353 3070.0401 3099.2733 3099.3471 3120.7489 3120.8373 3129.7272 3129.7703 3133.8501 3133.8745 3194.6532 3194.6699 3520.5746 3520.6069
redmass: 1.1070 1.0853 4.9642 4.6233 4.3607 4.0970 4.6280 5.2161 4.8953 3.6029 4.4753 2.8786 1.7219 3.8775 4.2138 4.3275 4.2946 4.3440 4.2974 3.4945 3.8276 4.1159 4.0231 3.2303 3.0804 3.9242 2.9602 3.0500 4.1231 3.4740 3.9256 2.6093 2.9407 2.9767 2.9740 5.7160 5.1689 1.1801 1.1788 5.2547 5.5912 3.5715 3.8227 1.0857 1.8093 1.8247 4.0166 1.5498 1.9983 2.3999 3.9967 1.4324 1.5345 1.4091 6.5180 5.7407 1.3771 1.3880 1.6704 1.6741 1.3783 1.3372 3.7452 2.6933 2.7313 1.6559 1.6557 5.4651 1.5623 2.5645 1.2759 1.3025 1.1738 1.1212 1.1230 3.8168 3.7340 2.1639 2.1035 1.3147 1.3859 2.0070 1.9946 1.2309 1.0679 1.4342 1.4291 1.4295 1.4259 1.5374 1.4947 1.4258 2.6379 2.8210 3.4946 3.4790 1.1317 1.1301 1.0709 1.0947 1.0471 1.0471 1.1037 1.1027 1.9123 1.9173 2.8677 2.8816 5.3764 5.3398 6.1193 6.1086 5.2664 5.3026 1.0593 1.0592 1.0597 1.0591 1.0382 1.0382 1.0984 1.1017 1.1044 1.1048 1.0984 1.0984 1.0874 1.0874 1.0910 1.0910 1.0958 1.0958 1.0979 1.0979 1.0943 1.0943 1.0763 1.0763
irintensity: 0.0001 0.0170 0.0073 0.6406 0.0103 5.2234 0.0012 12.3991 0.0102 4.0478 0.0237 0.4106 0.7369 0.6734 11.2924 1.5576 0.4512 0.0098 0.1265 0.1899 3.3503 2.0684 0.4638 0.1783 0.0689 0.0035 0.1526 0.0005 5.8630 30.7960 0.2036 0.1385 56.6892 0.0049 3.1455 0.1921 5.1183 2.1547 122.5171 8.8496 0.5274 0.0111 0.1385 4.2857 9.1773 9.5410 0.0001 0.0759 55.4538 10.5317 0.0572 0.0340 83.3393 0.0820 16.2224 0.7344 0.0623 2.0116 40.5675 3.0632 5.7874 0.0288 0.4785 0.0399 15.8031 1.1217 14.4178 0.0710 2.8306 0.0023 5.5898 5.0829 24.0918 3.5231 0.0199 104.5533 3.6918 0.9116 5.5706 17.5648 2.5300 77.0384 1.4882 0.0438 1.5552 0.0600 100.4621 21.2498 4.1017 0.0323 0.3323 33.1972 298.1780 22.8082 54.7318 34.3293 50.3498 54.9593 0.0054 0.2054 7.4570 31.6666 0.0314 16.6508 144.6100 20.3136 737.7510 19.5379 47.1835 33.8508 30.0452 22.2734 7.7792 264.8615 0.1749 2.7322 0.0795 140.2429 10.3689 10.0351 0.5480 0.0592 0.0003 88.7884 7.9420 24.9500 47.0158 3.8774 11.3319 36.3283 4.5528 24.6024 7.7088 8.3106 5.7954 3.3629 9.9285 11.7844
temp: 298.150 k
press: 1.00000 atm
elementType: 8 8 7 7 6 6 6 6 6 6 6 6 6 6 6 6 6 6 6 6 6 6 6 6 1 1 1 1 1 1 1 1 1 1 1 1 1 1 1 1 1 1 1 1 1 1 1 1
symmnumber: 1
zpe: 1041091.9 jmol-1
zpe.correction: 0.396531 hartree
zpe.thermalcorrener: 0.419334 hartree
zpe.thermalcorrenthalpy: 0.420279 hartree
zpe.thermalcorrgfe: 0.339775 hartree
zpe.sumelectzpe: -1034.768491 hartree
zpe.sumelectthermal: -1034.745688 hartree
zpe.sumelectthermalent: -1034.744744 hartree
zpe.sumelectthermalfe: -1034.825248 hartree
dipole: 0.0014 -7.5179 -0.0040
dipole: 7.5179
quadrupole: -112.5852 -142.1534 -148.4817
quadrupole: 0.0135 -6.6695 0.0249
quadrupole: 21.8216 -7.7466 -14.0750 0.0135 -6.6695 0.0249
hfenergy: -1035.1650224 hartree
pointgroup: C01 [X(C20H24N2O2)]
dipole: 0.0006652 2.9576421 0.0260174 debye
polarizability: 404.6035073|-0.4157529|225.3342145|39.787965|0.7721925|134.3618651 unknown
InChI: InChI=1S/C20H24N2O2/c1-15(23)21-19-11-7-17(8-12-19)5-3-4-6-18-9-13-20(14-10-18)22-16(2)24/h7-14,21-22H,3-6H2,1-2H3
charge 0 multiplicity 1
48 atoms
O  7.928406 -1.866109 0.338397
O  -7.927632 -1.853527 -0.375106
N  7.289883 0.388568 0.151599
N  -7.288361 0.39712 -0.146876
C  0.757065 0.218257 0.155087
C  -0.756506 0.220638 -0.148484
C  1.627334 0.229666 -1.132539
C  -1.627042 0.212062 1.138982
C  3.118435 0.252474 -0.833204
C  -3.118006 0.240833 0.839448
C  3.851505 -0.946912 -0.646184
C  -3.852016 -0.954624 0.631967
C  3.816955 1.478547 -0.68261
C  -3.8153 1.469872 0.70882
C  5.224655 -0.947812 -0.320609
C  -5.224853 -0.948776 0.305106
C  5.187006 1.5026 -0.357911
C  -5.185068 1.500644 0.383502
C  5.904989 0.290117 -0.1722
C  -5.903909 0.292085 0.176776
C  8.214427 -0.634354 0.386482
C  -8.213102 -0.620976 -0.401192
C  9.620025 -0.12059 0.71164
C  -9.61797 -0.100799 -0.719216
H  1.015553 1.101306 0.774899
H  1.017639 -0.673427 0.760945
H  -1.014826 1.113291 -0.754479
H  -1.017136 -0.661425 -0.768216
H  1.375529 -0.664129 -1.736885
H  1.349729 1.115027 -1.738639
H  -1.376113 -0.691423 1.729147
H  -1.348965 1.087481 1.759115
H  3.339534 -1.910676 -0.762971
H  -3.341071 -1.920702 0.733097
H  3.283204 2.426377 -0.826523
H  -3.280735 2.414627 0.868997
H  5.774631 -1.880341 -0.184737
H  -5.775534 -1.878379 0.153001
H  5.704408 2.466321 -0.25272
H  -5.701575 2.466433 0.294065
H  7.652762 1.342527 0.222601
H  -7.650559 1.352415 -0.201462
H  10.030083 0.480303 -0.121676
H  10.278953 -0.984156 0.881772
H  9.61654 0.508329 1.621664
H  -10.029095 0.485057 0.124218
H  -10.27697 -0.960856 -0.906011
H  -9.612803 0.544518 -1.617679
