program: Gaussian 09
title: 000257818
version: EM64L-G09RevD.01
frameworkgroup: C1[X(C20H22O2)]
method: RPBEPBE
basis: SDD
operation: Freq
keyword: #pfreq=noraman
keyword: PBEPBE/SDD
title: #p freq=noraman PBEPBE/SDD
converged: YES YES NO NO
title: Mulliken charges:
elementType: O O C C C C C C C C C C C C C C C C C C C C H H H H H H H H H H H H H H H H H H H H H H
charge: -0.229058 -0.229061 -0.370385 -0.370554 -0.576546 -0.576425 0.515696 0.515720 -0.425471 -0.425688 -0.410296 -0.410166 -0.347166 -0.347123 -0.356651 -0.356668 0.292685 0.292679 0.123651 0.123654 -0.792057 -0.792050 0.211440 0.215107 0.215109 0.211464 0.212499 0.213774 0.212456 0.213797 0.235201 0.235194 0.237531 0.237531 0.239771 0.239774 0.276019 0.276020 0.237286 0.236553 0.260459 0.237285 0.236556 0.260457
chargesum: 0.00000
title: Mulliken charges with hydrogens summed into heavy atoms:
elementType: O O C C C C C C C C C C C C C C C C C C C C
charge: -0.229058 -0.229061 0.056161 0.056019 -0.150273 -0.150173 0.515696 0.515720 -0.190271 -0.190494 -0.172765 -0.172635 -0.107395 -0.107349 -0.080633 -0.080648 0.292685 0.292679 0.123651 0.123654 -0.057759 -0.057752
polarizability: 3.63673780e+02 3.52951415e-02 2.09716871e+02 -3.56263328e+01 5.44314189e-02 1.26011048e+02
1716.lowfreq: -5.8795 -0.0007 0.0006 0.0008 2.9679 7.6465 18.1443 21.1072 23.5210
frequency: 7.0559 20.5761 23.5192 32.1445 43.2921 67.3576 67.5360 104.0919 107.8976 110.1321 112.5924 156.3461 156.3807 189.1196 190.5754 226.6347 229.1518 309.0608 331.9587 340.4719 340.5828 376.9708 388.9547 403.7108 403.9978 456.3497 462.2953 505.4856 514.8086 565.0733 568.1329 598.2121 601.7392 632.8595 632.8669 683.1383 689.7074 738.7519 747.1479 753.5977 783.8869 808.0431 817.6131 840.4584 847.8370 863.9782 869.2745 898.5979 945.5374 946.6798 966.9598 967.6082 997.3986 998.1314 1002.1622 1009.1744 1010.0192 1027.2774 1027.3042 1040.4628 1048.5908 1061.9199 1072.8127 1072.9901 1092.0476 1126.1027 1136.1951 1190.1922 1190.3299 1221.5083 1221.6500 1235.6031 1237.0145 1274.3000 1275.4017 1281.4312 1287.3710 1299.4280 1311.1760 1312.4392 1333.5920 1348.0113 1367.3400 1367.4749 1384.1241 1384.3187 1410.9213 1411.0224 1448.7590 1448.8311 1462.9642 1463.0136 1466.3905 1467.6974 1480.0926 1489.7658 1499.3454 1499.5942 1563.4886 1563.8567 1596.9767 1597.7279 1620.3924 1621.2381 2967.5119 2972.0731 2982.2733 2985.2375 2985.2705 2986.2417 3007.9671 3024.0774 3043.3647 3057.3221 3069.8621 3069.9039 3120.3208 3120.4036 3122.8907 3122.9426 3125.6836 3125.7141 3151.5660 3151.6260 3157.3240 3157.3362
redmass: 4.7347 5.3967 4.0280 4.0032 6.1443 3.9578 4.0053 2.7114 4.4645 1.8494 6.5190 1.0342 1.0345 3.4369 3.7941 5.4041 4.9840 4.6763 2.5947 2.8279 3.8213 3.9844 3.7248 2.8433 2.8553 3.6113 3.9974 3.1806 3.7791 4.5422 4.0098 2.3180 2.3580 6.8904 6.8676 3.8165 4.1715 1.0778 3.6938 3.7243 1.2109 3.4211 3.9051 1.5311 1.4833 1.3404 1.4718 1.3740 2.1738 2.1434 1.3670 1.3864 1.6019 1.3785 2.9604 3.0846 3.0068 1.8234 1.8226 5.3843 1.5574 2.6845 2.4890 2.4795 1.2788 1.3021 1.1663 1.1260 1.1249 2.5161 2.5411 1.3726 1.3158 3.7949 3.8011 1.2190 1.0668 1.4380 1.2918 1.3007 1.4000 1.4997 1.2681 1.2683 4.6567 4.5292 3.2720 3.2553 1.0980 1.0974 1.0502 1.0502 1.0720 1.0985 1.1088 1.1038 2.6012 2.5922 6.4441 6.4345 7.4289 7.4903 6.6152 6.5733 1.0594 1.0592 1.0596 1.0374 1.0374 1.0588 1.0991 1.1022 1.1045 1.1049 1.0969 1.0969 1.0885 1.0886 1.0892 1.0892 1.0989 1.0989 1.0943 1.0943 1.0956 1.0956
irintensity: 0.5985 0.5159 0.1633 2.5335 0.0005 7.0198 0.6698 0.0044 0.0726 0.2010 0.0001 0.8542 0.2199 0.2160 9.6652 0.0158 1.1817 0.3360 0.0126 2.6683 0.5589 0.9901 2.8137 0.0007 0.0906 3.9786 0.7827 0.0052 16.9086 3.3377 24.9937 0.1171 43.3497 0.3665 0.5608 14.0325 0.3242 4.5074 0.0000 0.9220 0.0486 22.3741 0.1273 0.0255 35.5530 0.0045 54.0314 0.3877 65.9269 5.9902 0.0098 0.4257 3.0391 0.0118 0.7380 0.2351 18.3089 0.5573 1.3337 0.0082 0.4571 0.0496 0.8935 1.9286 7.4846 1.1334 16.4998 61.4057 1.4487 0.0402 1.7360 10.7088 32.3169 494.3742 12.7657 0.0347 0.5558 0.0065 8.9150 0.3472 9.3647 0.0005 43.1856 64.4633 20.8395 2.3450 24.4217 21.9780 44.0053 17.0215 19.3840 21.9947 0.0086 0.4634 0.0025 19.2815 0.6378 0.2999 124.1172 30.9842 206.9705 109.6344 56.5383 18.3346 0.0363 4.9053 0.0447 3.5939 3.8082 117.9968 0.0590 0.0114 0.0168 81.6357 12.2753 13.9980 10.8705 17.7275 37.9366 5.4794 17.8496 7.5536 9.0791 27.8922 3.3430 0.4120
temp: 298.150 k
press: 1.00000 atm
elementType: 8 8 6 6 6 6 6 6 6 6 6 6 6 6 6 6 6 6 6 6 6 6 1 1 1 1 1 1 1 1 1 1 1 1 1 1 1 1 1 1 1 1 1 1
symmnumber: 1
zpe: 952891.6 jmol-1
zpe.correction: 0.362937 hartree
zpe.thermalcorrener: 0.384864 hartree
zpe.thermalcorrenthalpy: 0.385808 hartree
zpe.thermalcorrgfe: 0.307082 hartree
zpe.sumelectzpe: -924.195137 hartree
zpe.sumelectthermal: -924.173211 hartree
zpe.sumelectthermalent: -924.172267 hartree
zpe.sumelectthermalfe: -924.250993 hartree
dipole: -0.0015 5.2231 0.0046
dipole: 5.2231
quadrupole: -188.1292 -123.3087 -134.2782
quadrupole: -0.0121 3.6190 0.0007
quadrupole: -39.5572 25.2634 14.2938 -0.0121 3.6190 0.0007
hfenergy: -924.5580745 hartree
pointgroup: C01 [X(C20H22O2)]
dipole: -0.0002126 -2.0548709 -0.0161421 debye
polarizability: 363.2330227|-0.3468409|209.7117091|37.0630893|0.6588538|126.4569683 unknown
InChI: InChI=1S/C20H22O2/c1-15(21)19-11-7-17(8-12-19)5-3-4-6-18-9-13-20(14-10-18)16(2)22/h7-14H,3-6H2,1-2H3
charge 0 multiplicity 1
44 atoms
O  -7.919684 1.22572 -0.479403
O  7.919156 1.212896 0.495445
C  -0.754758 -0.036377 -0.165305
C  0.752281 -0.038431 0.169942
C  -1.648493 -0.053942 1.108047
C  1.645539 -0.040072 -1.103871
C  -3.129784 -0.029126 0.77019
C  3.127099 -0.020718 -0.766866
C  -3.851408 -1.233888 0.56333
C  3.84852 -1.228781 -0.579612
C  -3.819116 1.203465 0.606039
C  3.817124 1.208944 -0.58448
C  -5.213692 -1.212574 0.200827
C  5.211408 -1.213667 -0.219072
C  -5.177877 1.231512 0.245439
C  5.176404 1.230823 -0.225429
C  -5.896412 0.022327 0.035285
C  5.894886 0.018257 -0.035492
C  -7.34674 0.103037 -0.348866
C  7.346037 0.092542 0.34689
C  -8.121571 -1.191291 -0.582158
C  8.121592 -1.205495 0.555923
H  -1.00155 -0.915502 -0.794244
H  -1.002642 0.858849 -0.770407
H  1.000287 0.84915 0.786132
H  0.999165 -0.92539 0.787753
H  -1.406092 -0.958948 1.698612
H  -1.387059 0.820785 1.734989
H  1.402191 -0.937235 -1.70587
H  1.384329 0.842808 -1.719412
H  -3.338792 -2.195001 0.693348
H  3.335239 -2.187529 -0.723696
H  -3.279839 2.144654 0.769835
H  3.278083 2.152818 -0.732876
H  -5.743224 -2.159715 0.051631
H  5.740767 -2.163236 -0.085576
H  -5.717336 2.176553 0.120492
H  5.716418 2.173582 -0.086419
H  -8.135241 -1.816625 0.330112
H  -7.660646 -1.791491 -1.388669
H  -9.156048 -0.943196 -0.863439
H  8.131916 -1.815627 -0.366606
H  7.6635 -1.818945 1.354043
H  9.157063 -0.962118 0.837668
