program: Gaussian 09
title: 000257817
version: EM64L-G09RevD.01
frameworkgroup: C1[X(C7H4Cl3O3P)]
method: RPBEPBE
basis: SDD
operation: Freq
keyword: #p
keyword: freq=noraman
keyword: PBEPBE/SDD
title: #p freq=noraman PBEPBE/SDD
converged: YES YES NO NO
title: Mulliken charges:
elementType: Cl Cl Cl P O O O C C C C C C C H H H H
charge: -0.091522 -0.116838 -0.087797 0.887806 -0.483384 -0.490489 -0.103238 0.371185 0.422345 -0.340675 -0.318086 -0.328887 -0.269413 -0.177306 0.276591 0.293281 0.282871 0.273558
chargesum: 0.00000
title: Mulliken charges with hydrogens summed into heavy atoms:
elementType: Cl Cl Cl P O O O C C C C C C C
charge: -0.091522 -0.116838 -0.087797 0.887806 -0.483384 -0.490489 -0.103238 0.371185 0.422345 -0.064084 -0.024805 -0.046016 0.004144 -0.177306
polarizability: 2.51600070e+02 7.49728828e+00 1.33308693e+02 8.72482961e+00 -3.68776731e+00 9.20141964e+01
1716.lowfreq: -6.3990 -3.5856 -0.0024 -0.0024 -0.0019 5.6089 14.4817 25.4824 46.4729
frequency: 14.3759 25.2755 46.4653 62.3665 88.6605 113.6753 152.2607 168.2360 190.6246 237.9511 243.9541 275.3709 308.0796 347.7674 378.2453 407.9966 438.3909 445.0702 471.7363 506.6516 568.3172 622.6807 630.2428 659.5692 734.7699 811.0756 838.4367 849.8468 866.6506 981.0642 990.5267 1005.4369 1050.2781 1121.7200 1148.2298 1189.4726 1207.9218 1302.1803 1375.9980 1415.2089 1477.0619 1570.8832 1601.5168 1707.2920 3161.1810 3163.2809 3182.2574 3187.0692
redmass: 16.7170 12.4349 6.7176 9.7522 11.5218 25.1581 19.3181 12.0411 14.3615 11.7577 14.7462 15.2140 9.2366 9.3325 14.6989 2.9247 12.3908 12.5715 7.4098 5.7708 8.0330 4.6148 6.9252 10.5366 4.3099 8.0424 1.2422 7.4621 1.6075 1.3527 1.3663 2.9355 17.9029 1.3463 2.7987 1.6529 2.4529 1.2646 5.6619 3.9762 2.3322 7.3397 6.3811 12.9110 1.0908 1.0899 1.0957 1.0974
irintensity: 0.0067 1.0725 0.1388 2.3512 2.0275 0.2403 0.2070 3.3267 10.7310 0.9945 10.8379 15.1632 9.3695 50.3179 10.1475 0.7423 78.6722 30.8021 101.1193 44.8943 27.6968 22.3149 1.4853 223.6211 5.6822 49.2605 0.8325 257.1831 74.1599 0.6031 0.1356 10.9540 79.5837 8.2019 154.3651 72.7677 170.3576 1.6506 1.6888 22.6093 32.2655 55.9676 79.5667 304.2020 0.3973 0.4018 0.7749 0.9810
temp: 298.150 k
press: 1.00000 atm
elementType: 17 17 17 15 8 8 8 6 6 6 6 6 6 6 1 1 1 1
symmnumber: 1
zpe: 259250.6 jmol-1
zpe.correction: 0.098743 hartree
zpe.thermalcorrener: 0.113415 hartree
zpe.thermalcorrenthalpy: 0.114359 hartree
zpe.thermalcorrgfe: 0.052807 hartree
zpe.sumelectzpe: -2215.215313 hartree
zpe.sumelectthermal: -2215.200641 hartree
zpe.sumelectthermalent: -2215.199697 hartree
zpe.sumelectthermalfe: -2215.261249 hartree
dipole: -1.7461 -1.3076 -0.5453
dipole: 2.2485
quadrupole: -134.9454 -108.0168 -110.7473
quadrupole: 4.7172 -1.4136 -0.3959
quadrupole: -17.0422 9.8864 7.1558 4.7172 -1.4136 -0.3959
hfenergy: -2215.3140562 hartree
pointgroup: C01 [X(C7H4Cl3O3P1)]
dipole: 0.6369514 0.610346 -0.0660177 debye
dipolederiv: -0.7117069 -0.201229 0.1671007 -0.3610262 -0.3371084 0.1392481 0.2926582 0.0984912 -0.2724792 -0.3034578 -0.0073642 0.0185155 0.0562032 -0.2012046 -0.0833596 -0.5324609 0.0079971 -0.8602954 -0.5016115 -0.2888468 -0.0576119 -0.566746 -0.8554878 -0.1603812 -0.1080058 -0.1599251 -0.1711337 2.439174 0.185944 -0.1152241 -0.2123917 1.3153196 -0.1211232 0.0907357 -0.0904831 1.9099087 -1.736032 -0.005743 -0.0160643 0.1798394 -0.4002807 0.0428843 0.4053714 0.0074233 -0.3841301 -0.6897637 -0.0285142 0.0040063 0.1345141 -0.5731922 -0.0140832 0.0446497 -0.0451409 -0.5375815 -0.9748112 0.2881312 0.1210992 0.2287172 -0.8706613 -0.1872701 0.1576507 -0.2073084 -0.2920891 1.354122 -0.0162342 -0.0069214 0.281503 0.2373638 0.0887784 -0.2447353 0.0676011 0.09524 -0.9900732 -0.100207 0.0149589 -0.3809485 -0.1888814 -0.0486774 0.0153481 -0.043568 -0.0088995 -0.4887812 0.1583244 0.0204358 0.0896894 0.0056484 -0.0037333 -0.1124376 0.0072132 -0.1374899 -0.2957481 -0.1522105 -0.0476235 -0.2559178 -0.1500482 0.0195047 -0.0218046 0.0074355 -0.1156657 0.2471875 -0.1317449 -0.0598089 0.2430612 0.0641915 0.0184265 0.0910263 0.0491741 -0.062495 0.1689706 0.1277894 -0.0136372 -0.0653721 0.0122755 0.0491177 0.0077693 0.0098733 -0.0573477 2.1737474 0.1489484 -0.0797653 0.6245243 1.7044654 0.3701583 -0.0977641 0.3913993 0.2942468 0.072534 -0.0622829 -0.0004323 -0.0539111 0.0414078 -0.0337934 -0.0234256 -0.029312 0.1505265 0.0662858 0.0501086 0.036911 0.0638269 0.0812465 -0.0178418 0.0083188 -0.0195827 0.1530587 0.0610358 0.0750377 0.0250435 0.017888 0.0669619 -0.0290289 0.0339589 -0.0287895 0.148009 0.1089285 -0.0399071 -0.010982 -0.0234533 0.0479841 -0.0288259 -0.0068532 -0.0224983 0.1486171 unknown
polarizability: 249.2738239|19.762107|132.2339735|-1.73587|12.6066244|95.4151615 unknown
InChI: InChI=1S/C7H4Cl2O3P.Cl/c8-7(10)5-1-3-6(4-2-5)12-13(9)11;/h1-4H;
charge 0 multiplicity 1
18 atoms
Cl 4.958141 0.923324 -0.670599
Cl 3.347704 -0.049358 2.321799
Cl -4.304759 -1.755387 -0.260504
P  3.289819 -0.314686 0.089333
O  2.016855 0.763955 -0.411343
O  3.232561 -1.817337 -0.391667
O  -4.391357 0.869997 0.454766
C  0.634199 0.466634 -0.24361
C  -2.134405 0.094776 -0.02236
C  -0.170662 1.556002 0.159383
C  0.089768 -0.805196 -0.535636
C  -1.558365 1.368153 0.260388
C  -1.301129 -0.983827 -0.417703
C  -3.605994 -0.016873 0.122536
H  0.297836 2.51944 0.376349
H  0.73363 -1.633277 -0.848008
H  -2.209548 2.193026 0.565528
H  -1.747191 -1.957467 -0.636553
