program: Gaussian 09
title: 000257815
version: EM64L-G09RevD.01
frameworkgroup: C1[X(C7H4Cl5O2P)]
method: RPBEPBE
basis: SDD
operation: Freq
keyword: #p
keyword: freq=noraman
keyword: PBEPBE/SDD
title: #p freq=noraman PBEPBE/SDD
converged: YES YES NO NO
title: Mulliken charges:
elementType: Cl Cl Cl Cl Cl P O O C C C C C C C H H H H
charge: 0.091899 0.106261 0.117048 -0.092701 -0.123826 0.886835 -0.481464 -0.493438 0.483264 0.311494 -0.313786 -0.781633 -0.316105 -0.228770 -0.209047 0.263899 0.286299 0.245975 0.247795
chargesum: 0.00000
title: Mulliken charges with hydrogens summed into heavy atoms:
elementType: Cl Cl Cl Cl Cl P O O C C C C C C C
charge: 0.091899 0.106261 0.117048 -0.092701 -0.123826 0.886835 -0.481464 -0.493438 0.483264 0.311494 -0.049886 -0.781633 -0.029805 0.017205 0.038748
polarizability: 1.91796223e+02 2.44726011e+01 1.81614803e+02 5.05874071e+00 1.91793527e+00 1.21093097e+02
1716.lowfreq: -5.3247 -3.8530 -0.0029 -0.0023 0.0021 5.3514 15.8517 33.2384 50.7114
frequency: 15.7573 33.2271 50.6897 58.5597 97.3785 113.6186 130.3652 146.7462 160.8779 192.8065 218.1762 240.4221 248.2747 256.5523 273.6972 283.1802 324.8496 369.5864 375.8313 444.1196 456.5291 462.5256 517.6449 553.9144 606.4910 645.7252 666.8937 719.7061 749.7440 779.6556 797.1689 869.9354 884.0369 963.9928 995.8543 1044.4802 1054.6992 1092.0040 1171.3442 1184.4489 1207.8768 1282.7139 1371.9963 1428.7458 1466.0080 1578.8801 1596.3297 3145.8390 3156.5600 3172.9195 3187.5359
redmass: 19.9674 20.2628 21.9104 12.5892 5.8958 21.5676 11.8411 11.8774 18.5215 17.8184 15.2336 15.0400 12.7720 16.1307 15.5345 25.2725 5.7560 19.9738 13.9179 12.4946 4.6278 11.8881 5.6946 5.7580 7.5182 10.6842 6.1050 10.0727 3.1197 1.4705 7.0432 7.4588 1.4497 1.3755 1.3438 5.6857 3.2362 3.5148 2.1608 1.0597 3.1733 1.4357 10.7947 2.1719 2.4211 6.3382 6.5553 1.0881 1.0911 1.0959 1.0973
irintensity: 0.5349 0.3096 0.8120 0.3673 0.1145 0.1660 0.4440 1.6339 6.3718 3.0153 4.8988 4.4001 2.1696 2.0771 10.6980 3.6292 3.1644 10.0791 31.4409 72.9924 22.0585 71.4754 41.0622 21.6088 21.8412 58.2599 135.4099 137.8028 96.8439 20.2055 69.1564 48.9474 4.9508 0.9464 0.3276 65.0711 24.6144 26.5366 39.1975 1.9293 61.8897 14.1575 1.8836 36.8953 24.2669 3.0100 15.1120 2.7761 2.7756 6.0866 7.5789
temp: 298.150 k
press: 1.00000 atm
elementType: 17 17 17 17 17 15 8 8 6 6 6 6 6 6 6 1 1 1 1
symmnumber: 1
zpe: 256281.5 jmol-1
zpe.correction: 0.097612 hartree
zpe.thermalcorrener: 0.114144 hartree
zpe.thermalcorrenthalpy: 0.115088 hartree
zpe.thermalcorrgfe: 0.050164 hartree
zpe.sumelectzpe: -3059.996389 hartree
zpe.sumelectthermal: -3059.979858 hartree
zpe.sumelectthermalent: -3059.978914 hartree
zpe.sumelectthermalfe: -3060.043838 hartree
dipole: 2.5115 3.5534 0.1856
dipole: 4.3553
quadrupole: -131.5420 -118.5096 -132.3371
quadrupole: 10.6004 -0.6092 -0.0255
quadrupole: -4.0791 8.9533 -4.8742 10.6004 -0.6092 -0.0255
hfenergy: -3060.0940016 hartree
pointgroup: C01 [X(C7H4Cl5O2P1)]
dipole: -1.0203651 1.3733842 -0.093876 debye
dipolederiv: -0.7201487 -0.0685183 -0.1273989 -0.1273551 -0.1667398 -0.0169495 -0.1438235 -0.0152366 -0.1742832 -0.277111 0.1468725 0.2528551 0.0327671 -0.345788 -0.1871345 0.1968856 -0.1941715 -0.4477807 -0.144701 0.0276275 -0.0701531 -0.0662354 -0.3674276 0.250089 -0.0568911 0.2463356 -0.609034 -0.3350601 0.1613493 -0.044739 0.3746787 -0.705684 0.1606711 -0.1738507 0.1843276 -0.2185201 -0.3074746 0.040963 -0.0248446 -0.0732591 -0.1704763 0.0417173 0.4270517 -0.1109536 -0.8128209 1.9783622 -0.4032161 0.0569403 -0.2328233 1.5384622 -0.2046247 -0.0403791 -0.1160716 1.7516399 -1.1654694 0.3457319 -0.05284 0.2678349 -0.4662613 0.0415793 -0.3722241 0.1447643 -0.3475028 -0.6846969 0.0292605 -0.0299817 -0.0564913 -0.5489888 -0.0196506 -0.107955 -0.0129086 -0.5345804 -0.2185737 -0.0697138 -0.0270786 0.0283867 -0.3149932 -0.0219301 0.1210341 -0.1040646 -0.1823905 0.6412147 -0.0974595 0.0756688 -0.5534185 0.3788276 -0.0130388 0.2253194 -0.0366409 0.0860937 -0.0247882 -0.0769799 0.0336856 0.1811366 -0.052346 0.0001736 -0.0144009 -0.0023179 -0.0912399 1.2901422 0.0155592 -0.0429463 0.2982658 1.1056517 -0.0213326 0.0411309 0.0040058 1.3084442 -0.0741342 -0.004694 0.0223958 0.0608894 -0.2166393 0.0161783 -0.0091055 0.005895 -0.1046122 -0.0133018 -0.1462943 0.0313265 -0.1630911 -0.0209852 -0.0410888 0.0208748 -0.041785 -0.1191176 -0.0547176 0.0845318 0.0618062 0.0039232 0.173946 0.0175303 -0.0336489 0.0547206 -0.0942246 0.0200322 -0.0192404 -0.0258503 -0.0172282 0.1261722 -0.011184 -0.0441824 0.0145988 0.1407921 0.0092242 -0.0189354 -0.0404865 -0.0191869 0.1244219 0.0136949 -0.0107189 -0.0153201 0.1456082 -0.0024435 0.0933996 -0.0316791 0.074422 0.001442 0.014238 -0.014418 0.0092244 0.1533951 0.0836451 -0.0402437 -0.0166803 -0.0132154 -0.0725941 -0.0189381 -0.0106984 -0.0144017 0.1501337 unknown
polarizability: 192.9697132|-24.1272516|180.4091989|5.1701177|-2.8112618|121.1252114 unknown
InChI: InChI=1S/C7H4Cl4O2P.Cl/c8-7(9,10)5-3-1-2-4-6(5)13-14(11)12;/h1-4H;
charge 0 multiplicity 1
19 atoms
Cl -3.395386 -1.683269 -0.538026
Cl -0.571779 -2.152367 -1.444415
Cl -1.264665 -2.194132 1.516559
Cl 3.246201 -2.30594 0.655668
Cl 2.631823 -0.186492 -2.139913
P  2.661164 -0.2418 0.111818
O  0.989711 -0.388235 0.579682
O  3.510036 0.922859 0.758159
C  -1.300853 0.147181 -0.017719
C  0.013564 0.606075 0.299858
C  -2.295881 1.134449 -0.220253
C  -1.60281 -1.3340 -0.110744
C  0.320517 1.977066 0.418339
C  -1.998065 2.510345 -0.123566
C  -0.690557 2.934196 0.196177
H  -3.313291 0.8163 -0.458606
H  1.336073 2.288414 0.686275
H  -2.790368 3.245149 -0.29554
H  -0.455933 3.999803 0.280248
