program: Gaussian 09
title: 000257809
version: EM64L-G09RevD.01
frameworkgroup: C1[X(C10H8Cl2F4S2)]
method: RPBEPBE
basis: SDD
operation: Freq
keyword: #p
keyword: freq=noraman
keyword: PBEPBE/SDD
title: #p freq=noraman PBEPBE/SDD
converged: YES YES NO NO
title: Mulliken charges:
elementType: Cl Cl S S F F F F C C C C C C C C C C H H H H H H H H
charge: -0.053515 -0.053513 0.299215 0.299210 -0.157684 -0.144238 -0.144236 -0.157689 -0.632727 -0.632697 0.387726 0.279780 0.279809 0.387735 -0.616829 -0.616831 -0.510302 -0.510301 0.286619 0.305211 0.286618 0.305214 0.282790 0.273925 0.282786 0.273924
chargesum: 0.00000
title: Mulliken charges with hydrogens summed into heavy atoms:
elementType: Cl Cl S S F F F F C C C C C C C C C C
charge: -0.053515 -0.053513 0.299215 0.299210 -0.157684 -0.144238 -0.144236 -0.157689 -0.632727 -0.632697 0.387726 0.279780 0.279809 0.387735 -0.025000 -0.024998 0.046412 0.046409
polarizability: 2.36631379e+02 8.50218011e-04 1.53232181e+02 3.96056156e+00 1.40400293e-03 1.36973294e+02
1716.lowfreq: -9.4076 -2.2180 0.0008 0.0011 0.0024 5.3894 16.2361 20.7204 23.3540
frequency: 15.9170 20.6693 23.1077 33.5847 70.8021 81.4201 83.1776 117.5968 118.2184 154.4319 169.8558 180.0482 200.5722 208.6434 211.4246 211.4932 270.4494 280.2620 290.5648 295.0858 302.8714 343.7475 379.8885 387.5246 422.9555 476.5310 481.5552 617.0799 628.7240 633.6759 646.8098 668.5109 668.7480 691.9770 753.6626 757.8673 771.3478 779.2959 891.1029 893.1513 970.5379 970.5819 1056.5149 1065.8370 1066.6320 1112.5355 1113.5024 1165.6352 1229.7572 1230.4678 1263.4964 1264.0021 1286.4189 1286.5629 1332.3082 1351.1217 1386.8566 1420.3412 1455.0843 1455.4625 1457.6806 1457.7436 1555.2141 1591.3651 3058.6969 3058.7114 3069.5113 3069.5637 3135.3735 3135.3958 3161.4691 3161.5199
redmass: 16.6339 14.8334 15.6633 15.5732 10.6540 2.1710 2.2225 7.8499 16.0866 7.7393 4.7846 6.7592 5.0512 9.2669 6.4158 8.0919 17.3028 14.1603 15.0045 17.7443 12.8598 10.6823 12.6393 9.3164 15.9335 14.8214 16.7452 10.1706 8.9184 8.8156 12.0290 5.3774 5.4311 9.6823 8.2766 2.3970 1.1598 1.9834 11.4775 12.1349 1.3999 1.4190 12.7614 4.4873 4.5066 1.0574 1.0564 10.1689 1.1406 1.1535 1.1821 1.1784 1.1945 1.1976 12.0435 11.6260 12.0051 10.7351 1.0915 1.0996 1.1001 1.1010 11.8563 11.8644 1.0604 1.0604 1.0560 1.0560 1.1075 1.1075 1.1111 1.1111
irintensity: 0.0343 0.0370 0.1965 0.6797 0.7007 2.6053 0.1449 1.7709 0.0575 3.1860 1.3632 1.4237 3.6767 3.4226 1.2415 8.4890 1.2496 1.0769 0.5667 5.1554 2.7846 0.0029 5.9405 1.8732 0.0673 0.9673 0.0807 57.0400 39.0681 43.9450 2.2895 3.6201 16.4325 0.0069 74.5500 4.9510 0.1175 4.0185 105.8667 5.4889 0.5254 5.6776 0.4529 7.8699 6.1807 6.9036 1.3314 8.5618 1.7147 18.0320 3.3155 0.0039 6.4477 7.6840 1.9420 6.6412 36.9151 304.9880 1.7400 17.5055 1.2027 7.1534 0.3305 2.3251 2.4461 0.4264 23.4551 0.6812 3.3304 0.1892 11.4890 0.0881
temp: 298.150 k
press: 1.00000 atm
elementType: 17 17 16 16 9 9 9 9 6 6 6 6 6 6 6 6 6 6 1 1 1 1 1 1 1 1
symmnumber: 1
zpe: 422462.7 jmol-1
zpe.correction: 0.160908 hartree
zpe.thermalcorrener: 0.180826 hartree
zpe.thermalcorrenthalpy: 0.181770 hartree
zpe.thermalcorrgfe: 0.107815 hartree
zpe.sumelectzpe: -2500.094055 hartree
zpe.sumelectthermal: -2500.074137 hartree
zpe.sumelectthermalent: -2500.073193 hartree
zpe.sumelectthermalfe: -2500.147148 hartree
dipole: 0.0000 -0.9573 0.0000
dipole: 0.9573
quadrupole: -128.1004 -145.8694 -141.4474
quadrupole: -0.0016 -4.2823 -0.0003
quadrupole: 10.3720 -7.3970 -2.9750 -0.0016 -4.2823 -0.0003
hfenergy: -2500.2549628 hartree
pointgroup: C01 [X(C10H8Cl2F4S2)]
dipole: 0.0000579 -0.000041 -0.3766496 debye
dipolederiv: -0.2316404 0.040226 0.1248989 0.1069599 -0.2186278 -0.1759821 0.341569 -0.120076 -0.6968872 -0.2315789 0.0401778 -0.1248452 0.1068584 -0.2185741 0.175898 -0.3415489 0.1199764 -0.6970337 -0.1423759 0.0787796 0.1486306 0.2253417 -0.0053678 0.0611225 0.1289748 0.0479381 -0.1728843 -0.142423 0.07875 -0.1486801 0.225329 -0.0053954 -0.0610959 -0.1290516 -0.047964 -0.1729163 -0.4470989 0.332003 -0.0431308 0.3465856 -0.6739182 0.0906681 0.0266231 0.0263542 -0.1100289 -0.3060741 -0.2691027 0.0237409 -0.2867404 -0.7842068 0.0715771 0.0268487 -0.0159219 -0.0969381 -0.3060655 -0.2691069 -0.0237019 -0.2867398 -0.7842164 -0.071423 -0.0268041 0.0160834 -0.096933 -0.4471245 0.3320108 0.0429333 0.3465981 -0.6739437 -0.0903986 -0.0268435 -0.0260827 -0.1099921 0.4276218 0.0132456 -0.1303232 -0.0473384 -0.1732032 -0.0815657 -0.052551 -0.0385294 -0.1835687 0.4277462 0.0132642 0.1304625 -0.0473382 -0.1731559 0.0815529 0.052684 0.0385369 -0.1835644 0.2817876 -0.5565132 0.0852164 -0.2769516 0.6599129 -0.0943668 -0.1372946 -0.0471579 0.1134707 0.1292147 0.4666348 -0.054073 0.1930169 0.8529805 -0.092163 -0.1234939 0.0340724 0.0991468 0.1292569 0.466635 0.0539202 0.1930078 0.8529931 0.0919713 0.1234311 -0.0342009 0.0991745 0.2817096 -0.5565342 -0.0849923 -0.2769818 0.6599271 0.0941047 0.1374481 0.0468263 0.1134279 0.0702566 -0.0548767 -0.1234808 -0.2545614 0.0298455 0.0584319 -0.1528651 0.0633178 0.2603885 0.070232 -0.0548755 0.1234583 -0.2545439 0.0297837 -0.0584309 0.1528737 -0.0632594 0.2605009 0.1989076 -0.0322694 -0.1178905 0.0137665 0.2096289 0.1506975 -0.3581089 0.2148939 0.7280161 0.1988693 -0.0322174 0.1178408 0.0138769 0.2095533 -0.1505892 0.358027 -0.2147956 0.7281847 -0.0442407 0.0368877 -0.0375165 0.0231793 0.1033979 0.0002433 0.0550637 -0.0162231 0.0353823 0.1065299 -0.0600086 0.0104099 -0.0427853 -0.004172 -0.0034309 0.0049652 -0.03068 0.0122688 -0.0442325 0.0369393 0.0374911 0.0231913 0.1033838 -0.0002727 -0.0550572 0.0162026 0.0353568 0.1065108 -0.0600224 -0.0103755 -0.0428072 -0.0041183 0.0034353 -0.0049079 0.0306707 0.012272 0.0388541 -0.0490012 0.0373406 -0.0447111 -0.0445121 -0.0087685 0.013366 -0.0678714 0.0060126 -0.0817536 0.0539936 -0.015586 0.0442479 0.04823 -0.0229794 0.0115024 -0.0474469 0.005589 0.038829 -0.0490536 -0.0373229 -0.044743 -0.0444621 0.0087913 -0.0133349 0.0678898 0.005984 -0.0817182 0.054034 0.0155751 0.0442827 0.048237 0.0229728 -0.0115152 0.0474467 0.0055709 unknown
polarizability: 234.8819908|-13.6735569|138.7226798|0.0131645|-0.0022582|153.2321832 unknown
InChI: InChI=1S/C10H8Cl2F4S2/c11-1-3-17-9-5(13)7(15)10(18-4-2-12)8(16)6(9)14/h1-4H2
charge 0 multiplicity 1
26 atoms
Cl -4.103323 0.780148 3.467235
Cl 4.103004 -0.779444 3.468256
S  -3.253894 -0.306801 -0.861631
S  3.254119 0.306529 -0.860965
F  -1.564251 2.305505 -0.794956
F  1.165045 2.532491 -0.741058
F  -1.164846 -2.532722 -0.740517
F  1.564465 -2.305752 -0.793814
C  -1.441015 -0.118701 -0.757281
C  1.441217 0.118464 -0.75698
C  -0.798179 1.139371 -0.770616
C  0.604517 1.258456 -0.754804
C  -0.604315 -1.258692 -0.754544
C  0.798385 -1.139611 -0.770059
C  -3.805168 0.646339 0.702089
C  3.805026 -0.646324 0.703058
C  -3.526379 -0.191055 1.942608
C  3.526411 0.191495 1.943329
H  -4.884829 0.805493 0.548203
H  -3.295282 1.619734 0.719375
H  4.884651 -0.805819 0.549271
H  3.294865 -1.619572 0.720586
H  -4.091059 -1.133765 1.955922
H  -2.453935 -0.376915 2.100837
H  4.091356 1.134049 1.956406
H  2.454012 0.3777 2.101452
