program: Gaussian 09
title: 000257768
version: EM64L-G09RevD.01
frameworkgroup: C1[X(C24H22N8O6)]
method: RPBEPBE
basis: SDD
operation: Freq
keyword: #p
keyword: freq=noraman
keyword: PBEPBE/SDD
title: #p freq=noraman PBEPBE/SDD
converged: YES YES NO NO
title: Mulliken charges:
elementType: O O O O O O N N N N N N N N C C C C C C C C C C C C C C C C C C C C C C C C H H H H H H H H H H H H H H H H H H H H H H
charge: -0.286614 -0.286710 -0.451493 -0.451505 -0.214360 -0.214358 -0.060511 -0.060433 -0.664867 -0.664956 -0.239521 -0.239782 -0.422553 -0.422641 0.001849 0.001622 0.465093 0.465235 -0.472582 -0.567686 0.286018 0.286138 0.260726 0.260947 -0.318849 -0.318853 -0.343985 -0.343924 -0.345138 -0.375161 -0.345182 -0.375192 0.183392 0.183576 -0.385816 -0.385873 0.180557 0.180519 0.272248 0.218022 0.208328 0.208243 0.278114 0.278140 0.274372 0.239227 0.274365 0.239225 0.300720 0.384362 0.384412 0.300693 0.361706 0.361669 0.282823 0.281921 0.282955 0.281882 0.394725 0.394720
chargesum: 0.00000
title: Mulliken charges with hydrogens summed into heavy atoms:
elementType: O O O O O O N N N N N N N N C C C C C C C C C C C C C C C C C C C C C C C C
charge: -0.286614 -0.286710 -0.056769 -0.056785 -0.214360 -0.214358 -0.060511 -0.060433 0.020215 0.020150 -0.239521 -0.239782 -0.060847 -0.060972 0.001849 0.001622 0.465093 0.465235 -0.200334 -0.349663 0.286018 0.286138 0.260726 0.260947 -0.110521 -0.110610 -0.065871 -0.065784 -0.070766 -0.135933 -0.070817 -0.135966 0.183392 0.183576 0.178929 0.178964 0.180557 0.180519
polarizability: 1.07465431e+03 -8.60133282e-02 4.70337851e+02 2.72229799e+01 3.16378958e-02 1.42677312e+02
1716.lowfreq: -2.4783 -0.0007 0.0011 0.0014 1.4107 2.7580 8.3670 12.5087 14.5927
frequency: 8.3389 12.4575 14.5927 22.2958 27.3675 29.4096 31.6290 36.6200 39.9774 40.6824 55.7243 57.8836 66.0646 76.1414 81.5188 86.8836 129.1621 136.8589 141.0767 164.0949 175.0512 185.7385 193.7256 207.6103 233.8671 245.9049 259.7892 263.8644 264.6167 284.2345 331.4087 342.8067 345.9596 349.1374 349.3235 370.4939 405.8451 407.0081 413.7265 421.2472 433.4991 448.8104 457.9491 486.5457 488.2115 492.4399 506.4913 522.1758 525.2670 535.9644 542.3861 549.4114 549.6131 550.4413 555.5707 575.0359 579.4760 580.0688 608.7978 630.1240 632.8744 645.4254 649.2345 649.4355 684.6297 685.2064 705.6691 722.2393 722.7283 742.4889 768.8494 769.1653 771.1081 794.6521 801.3990 839.4920 839.5825 843.9343 844.2698 869.9532 870.0284 870.7123 871.7051 895.2821 903.2966 931.9099 932.0786 936.4670 977.8283 977.8836 981.2995 981.5250 997.6071 997.8318 1000.7160 1000.7764 1070.4608 1070.7174 1077.6469 1078.1121 1082.1526 1109.7856 1111.5562 1131.7911 1144.8470 1153.9097 1159.2007 1165.6753 1169.5566 1200.7750 1209.5208 1209.5671 1237.5263 1247.1507 1255.0991 1255.9257 1259.8904 1289.1134 1298.0340 1298.9215 1307.9274 1307.9589 1313.5402 1322.3510 1334.1104 1334.4063 1359.9376 1375.3282 1376.4198 1420.9759 1421.1307 1429.5870 1457.8448 1457.9579 1468.3802 1469.2548 1477.1771 1501.2913 1501.5231 1502.1807 1536.5010 1552.2002 1553.1622 1567.9126 1580.6257 1593.1260 1594.2880 1610.6137 1611.6833 1647.3835 1686.1302 1686.3534 2988.5097 2988.7481 3024.3500 3024.3608 3079.7961 3085.1884 3118.2781 3121.5979 3121.9838 3145.6657 3145.6704 3167.8819 3167.8915 3172.8418 3172.8906 3174.4808 3530.5411 3530.7267 3569.5075 3569.8180 3598.9500 3599.6481
redmass: 7.9134 6.6667 8.8472 5.2655 4.4102 7.0312 8.5319 4.3882 5.2674 7.0518 7.0085 5.0785 6.7528 6.9488 5.5668 6.8053 4.2027 8.0308 3.5210 7.3449 6.6213 4.4942 5.8214 5.5237 5.4260 6.5759 7.4725 8.8129 8.5633 5.9601 6.9057 5.5165 3.2867 6.6809 5.8038 6.0457 3.1508 2.9296 5.0370 3.5081 5.8711 4.6798 2.8609 2.2539 1.8408 4.3083 6.5093 3.1295 3.1467 4.2890 4.1253 1.2277 4.2807 4.3809 5.8227 1.5326 1.2271 1.2843 5.2787 7.0075 6.6026 7.3613 1.4613 1.4588 4.1321 4.0009 6.5469 7.8861 6.7503 1.9496 4.5593 3.9601 7.1899 5.9891 6.1992 1.3440 1.3462 2.3336 2.9203 1.6922 1.6896 4.4915 4.7854 6.5745 7.6676 1.1489 1.1035 1.4645 1.9049 1.9217 1.4377 1.4285 1.6906 1.7174 1.9836 2.0213 3.8578 3.9034 2.2167 2.1967 1.6676 1.4337 1.3370 2.2118 1.2792 1.8020 1.9665 2.7803 1.8538 2.3821 1.0829 1.0843 2.8740 2.2048 2.0015 1.8071 3.3818 1.7778 1.6879 1.6475 1.8612 1.8535 5.8722 8.3235 1.7483 1.7806 4.6260 5.7141 5.7289 4.4723 4.5080 3.3251 1.1275 1.1252 1.9686 2.0104 3.1473 2.7320 2.6205 2.4895 6.1360 6.2751 7.3176 1.6422 1.7732 6.9062 5.1131 5.6578 5.3098 7.6439 9.1836 9.1939 1.0605 1.0604 1.0988 1.0987 1.0696 1.0707 1.0905 1.0892 1.0892 1.0883 1.0883 1.0960 1.0960 1.0941 1.0941 1.0915 1.0644 1.0644 1.0778 1.0778 1.0855 1.0855
irintensity: 0.1102 4.6296 0.5687 1.2254 0.0107 0.4025 6.6253 0.8927 0.1534 11.4592 0.0030 2.4556 0.2070 5.1093 0.0304 5.0003 0.0008 0.3879 2.9996 2.3700 1.5539 0.2152 4.6788 2.8610 5.9031 5.2832 0.0007 7.9576 4.7230 0.4718 3.4168 0.7722 20.0852 14.2436 6.1832 7.2886 11.0657 0.0397 25.2581 0.0206 0.4805 4.2817 30.1019 8.8327 79.6345 1.2380 13.3279 9.8713 19.1446 49.5566 4.8419 187.0476 53.7429 8.5229 25.7232 0.3961 96.7935 9.2051 74.1193 0.1161 21.9618 2.2819 33.6397 313.5389 0.3203 97.2339 27.1116 0.5826 3.1026 7.9939 0.4737 31.9264 0.0628 0.5770 2.4737 10.6337 20.1332 48.9739 20.3683 65.9686 2.5896 147.8098 4.0243 9.5871 1.1838 224.2840 18.8846 10.4515 0.4681 3.4213 0.0813 1.6090 3.1032 3.1375 0.7887 0.8331 40.8281 14.9775 168.8081 106.5928 3.3515 16.0432 46.6488 218.4548 2.7286 13.7083 0.1713 9.3748 21.7526 0.4999 0.5677 0.0903 0.0441 339.7067 85.6840 141.7407 15.9739 52.2661 241.0572 3.4630 3.1546 129.2791 1613.8345 104.9822 51.9087 4.7620 106.0412 16.1691 0.2488 1.0934 7.2010 76.0487 36.4142 16.0029 480.2757 438.3589 141.2440 208.5339 52.8194 463.3935 0.3614 227.6652 24.5291 67.8226 281.0353 201.2788 159.4441 200.1684 0.2499 1067.4377 394.5500 265.3497 38.7639 39.7921 4.2416 4.8668 223.9500 136.3124 41.3888 31.4171 36.9972 2.9597 4.4921 2.8041 10.2473 1.9738 2.1891 0.0468 30.8520 30.8485 39.0976 55.7520 16.7523 107.4431
temp: 298.150 k
press: 1.00000 atm
elementType: 8 8 8 8 8 8 7 7 7 7 7 7 7 7 6 6 6 6 6 6 6 6 6 6 6 6 6 6 6 6 6 6 6 6 6 6 6 6 1 1 1 1 1 1 1 1 1 1 1 1 1 1 1 1 1 1 1 1 1 1
symmnumber: 1
zpe: 1165062.4 jmol-1
zpe.correction: 0.443749 hartree
zpe.thermalcorrener: 0.478777 hartree
zpe.thermalcorrenthalpy: 0.479721 hartree
zpe.thermalcorrgfe: 0.368374 hartree
zpe.sumelectzpe: -1814.430609 hartree
zpe.sumelectthermal: -1814.395581 hartree
zpe.sumelectthermalent: -1814.394637 hartree
zpe.sumelectthermalfe: -1814.505984 hartree
dipole: -0.0085 -1.5979 0.0667
dipole: 1.5993
quadrupole: -346.5988 -156.2209 -225.0013
quadrupole: 0.0654 -16.0160 0.0754
quadrupole: -103.9918 86.3861 17.6057 0.0654 -16.0160 0.0754
hfenergy: -1814.874358 hartree
pointgroup: C01 [X(C24H22N8O6)]
dipole: -0.0070865 -0.5563136 0.2939299 debye
polarizability: 1069.030203|28.5532384|387.5831726|71.180142|-140.9637816|231.0560932 unknown
InChI: InChI=1S/C24H22N8O6/c25-17-9-18(26)20(32-30-16-7-3-14(4-8-16)24(38)28-12-22(35)36)10-19(17)31-29-15-5-1-13(2-6-15)23(37)27-11-21(33)34/h1-10,27-28,33,35H,11-12,25-26H2
charge 0 multiplicity 1
60 atoms
O  9.407571 0.716893 0.738405
O  -9.284155 0.02703 -1.135995
O  7.932097 3.909201 -2.582079
O  -7.635232 4.424014 -2.29165
O  10.13883 4.645976 -2.557051
O  -9.821938 4.840593 -2.968456
N  2.378601 -1.490967 1.106042
N  -2.334482 -1.618067 0.712291
N  2.400088 -4.047222 2.598566
N  -2.465281 -4.184406 2.180836
N  3.555728 -1.960735 1.499657
N  -3.533426 -2.153946 0.90399
N  8.256641 2.070877 -0.738599
N  -8.057197 1.932351 -1.586556
C  1.244627 -2.243482 1.431357
C  -1.231323 -2.311362 1.222487
C  1.213268 -3.516158 2.168029
C  -1.254083 -3.585311 1.95722
C  0.019048 -1.696845 0.991219
C  -0.033064 -4.144663 2.405429
C  7.017592 0.323717 0.484577
C  -6.900766 -0.0297 -0.639054
C  4.669866 -1.148921 1.131482
C  -4.613995 -1.396339 0.361161
C  5.733663 0.790225 0.082404
C  -5.594103 0.501506 -0.834682
C  7.105541 -0.882209 1.226997
C  -7.042651 -1.261117 0.051294
C  4.571503 0.068557 0.398406
C  5.948363 -1.612913 1.54436
C  -4.461665 -0.167778 -0.343711
C  -5.915451 -1.93605 0.548876
C  8.305756 1.039536 0.183702
C  -8.159576 0.628019 -1.133864
C  9.473711 2.80922 -1.065505
C  -9.244657 2.620127 -2.086874
C  9.261265 3.875857 -2.122536
C  -8.976588 4.054672 -2.499715
H  0.03933 -0.749992 0.443744
H  -0.053564 -5.094484 2.954641
H  5.622849 1.736941 -0.460326
H  -5.442982 1.431535 -1.396309
H  8.09844 -1.217166 1.543206
H  -8.052709 -1.663339 0.177803
H  3.581029 0.421132 0.098156
H  6.011469 -2.546622 2.113087
H  -3.454003 0.229403 -0.493138
H  -6.019661 -2.884282 1.086689
H  2.425595 -4.926022 3.11347
H  3.248792 -3.484807 2.358239
H  -3.290949 -3.667341 1.799718
H  -2.529037 -5.067663 2.684714
H  7.409016 2.309539 -1.253886
H  -7.190285 2.467886 -1.534915
H  10.269772 2.124734 -1.420841
H  9.897611 3.296227 -0.165348
H  -10.050625 2.624522 -1.3261
H  -9.676766 2.086602 -2.95629
H  7.832684 4.614913 -3.275766
H  -7.498731 5.369402 -2.568605
