program: Gaussian 09
title: 000257765
version: EM64L-G09RevD.01
frameworkgroup: C1[X(C18H16N6O2S)]
method: RPBEPBE
basis: SDD
operation: Freq
keyword: #p
keyword: freq=noraman
keyword: PBEPBE/SDD
title: #p freq=noraman PBEPBE/SDD
converged: YES YES NO NO
title: Mulliken charges:
elementType: S O O N N N N N N C C C C C C C C C C C C C C C C C C H H H H H H H H H H H H H H H H
charge: 0.946153 -0.543292 -0.541631 -0.717734 -0.079193 -0.399308 -0.129391 0.031932 -0.230662 -0.047288 -0.215982 -0.217504 0.177139 -0.329671 -0.267285 0.433102 -0.091808 0.178875 -0.396351 -0.353982 -0.266606 -0.189028 -0.188969 -0.251656 -0.188044 -0.170818 -0.336018 0.283404 0.280240 0.265880 0.270838 0.333899 0.334115 0.230795 0.289557 0.388164 0.285577 0.228139 0.230304 0.232049 0.246538 0.237743 0.247776
chargesum: 0.00000
title: Mulliken charges with hydrogens summed into heavy atoms:
elementType: S O O N N N N N N C C C C C C C C C C C C C C C C C C
charge: 0.946153 -0.543292 -0.541631 -0.049720 -0.079193 -0.011144 -0.129391 0.031932 -0.230662 -0.047288 0.067423 0.062736 0.177139 -0.063790 0.003553 0.433102 -0.091808 0.178875 -0.165556 -0.064425 0.018971 0.039111 0.041334 -0.019607 0.058494 0.066925 -0.088241
polarizability: 6.47749314e+02 -4.02717966e+01 3.88350330e+02 5.06365813e+00 1.16679078e+01 1.33592455e+02
1716.lowfreq: -25.8641 -1.9616 -0.0009 0.0015 0.0015 2.3979 2.9927 18.2427 24.6549
frequency: -25.7272 18.1586 24.6094 29.4615 37.0476 55.9012 60.6077 73.7610 84.6690 103.5223 125.8648 135.3246 147.1587 174.1967 197.3878 218.3838 224.6115 255.7405 259.0705 264.4551 298.6174 311.1154 342.5693 351.5863 378.0014 405.4519 410.1881 414.9406 420.9119 437.1254 452.1497 463.2384 472.0358 516.0763 534.1195 552.2364 598.3161 611.8617 614.3667 625.0749 634.8838 651.0912 691.6919 703.6954 739.0414 749.7747 769.0925 778.9279 790.9511 796.4464 807.8163 830.3208 839.6457 844.1872 860.9915 896.5359 906.1885 908.7973 918.8478 966.7863 975.7899 977.5664 979.0152 983.7333 985.4149 991.1778 998.6428 1013.7860 1018.4362 1033.9817 1045.0097 1063.8374 1066.4827 1068.4450 1082.8585 1104.7404 1110.3103 1139.2869 1162.5100 1165.3155 1172.3719 1178.0947 1209.7465 1262.3189 1279.8510 1292.6070 1307.4044 1319.7746 1324.4224 1341.5506 1377.8058 1387.1578 1395.6824 1404.4852 1429.6598 1448.4733 1451.6273 1456.0657 1479.7450 1531.2456 1549.0747 1552.5568 1573.1718 1588.0203 1589.3759 1592.3297 1606.9570 2757.1801 3125.9749 3135.8443 3139.5444 3148.3297 3149.5436 3152.9821 3156.9469 3166.3529 3173.9818 3176.3297 3176.4364 3180.1263 3190.9059 3364.9689 3533.2503
redmass: 3.2037 5.2254 5.1556 4.8002 4.6228 4.4690 6.2174 5.1416 1.7973 6.6229 6.6249 6.1137 8.4042 6.0175 6.9541 7.4365 6.7108 6.1084 6.5068 2.7397 9.2049 7.0471 6.4184 6.4865 5.8050 2.8903 3.4934 3.1081 9.4466 5.7683 4.4705 7.6024 4.0481 3.1246 3.6440 5.0716 7.4744 6.9015 6.8002 7.1306 4.5579 6.6745 1.8814 6.5858 3.5677 1.9855 1.7312 5.1206 2.2574 2.0872 4.4898 4.3618 1.2575 1.2484 1.6642 5.7061 3.8616 1.3617 1.4297 1.4297 1.3591 4.6981 1.6165 5.9976 2.1304 1.9418 1.3200 1.3359 2.1177 2.4700 2.5539 1.4210 1.4495 1.9200 1.5852 1.5450 1.6771 2.0543 1.0926 1.4828 1.0820 1.3131 2.8713 1.9859 1.3656 2.6727 2.4267 6.0829 1.7703 9.2720 3.6615 5.9795 4.3442 4.1172 3.1965 2.3753 2.4101 2.3557 2.3918 1.0856 1.9477 4.0078 6.6607 5.9015 7.0774 5.1447 6.0074 1.0895 1.0867 1.0878 1.0883 1.0937 1.0911 1.0887 1.0884 1.0983 1.0956 1.0977 1.0974 1.0971 1.0969 1.0413 1.1001
irintensity: 4.4436 1.4687 2.7287 0.6598 2.1715 1.2129 1.5094 0.4409 31.3940 0.4736 2.5355 4.4879 0.3193 10.4785 4.7956 16.8765 1.7739 4.4709 3.6071 3.3658 0.7740 31.3719 2.0017 0.1444 3.5737 0.0170 6.0346 3.1695 62.6624 7.5962 73.9712 22.0467 116.5555 25.2028 74.1214 23.9572 63.6697 1.6156 6.6644 0.1761 13.3145 20.1548 41.1641 10.2448 1.7109 18.6566 86.6320 50.3215 49.2745 34.3808 283.6292 18.5191 0.6535 1.4162 60.9894 25.0588 53.1081 1.9264 5.9914 3.2794 0.5923 2.5912 1.4028 0.1370 0.5164 0.7811 1.0247 1.1021 6.7054 10.7676 66.8271 43.1056 53.4298 21.9417 22.6263 5.8273 26.6885 97.3422 1.7970 8.5846 2.0610 12.7291 0.1827 41.5308 19.1763 100.1475 221.9980 64.4033 196.5457 274.6494 125.4955 0.8257 56.9340 18.4536 161.6618 23.2916 111.1334 25.5254 18.7313 15.6029 240.9561 81.4993 21.4422 74.3436 4.9998 3.0701 9.8884 483.5286 8.3872 0.1506 10.0908 26.2179 12.0870 0.9150 1.2439 43.6806 1.5678 19.1910 1.4276 10.3430 6.3146 31.6370 23.7447
temp: 298.150 k
press: 1.00000 atm
elementType: 16 8 8 7 7 7 7 7 7 6 6 6 6 6 6 6 6 6 6 6 6 6 6 6 6 6 6 1 1 1 1 1 1 1 1 1 1 1 1 1 1 1 1
symmnumber: 1
zpe: 822924.6 jmol-1
zpe.correction: 0.313435 hartree
zpe.thermalcorrener: 0.337158 hartree
zpe.thermalcorrenthalpy: 0.338102 hartree
zpe.thermalcorrgfe: 0.257189 hartree
zpe.sumelectzpe: -1570.391892 hartree
zpe.sumelectthermal: -1570.368169 hartree
zpe.sumelectthermalent: -1570.367225 hartree
zpe.sumelectthermalfe: -1570.448139 hartree
dipole: 7.3039 1.7397 2.5732
dipole: 7.9370
quadrupole: -163.8844 -133.6269 -170.4193
quadrupole: 18.7610 -19.0794 -0.3328
quadrupole: -7.9076 22.3500 -14.4424 18.7610 -19.0794 -0.3328
hfenergy: -1570.7053272 hartree
pointgroup: C01 [X(C18H16N6O2S1)]
dipole: -2.777966 -0.5915102 1.2976583 debye
polarizability: 649.0626181|-33.6051709|372.4908746|-26.5517756|-55.5153321|148.1386068 unknown
InChI: InChI=1S/C18H16N6O2S/c19-27(25,26)16-11-9-15(10-12-16)22-24-18(17-8-4-5-13-20-17)23-21-14-6-2-1-3-7-14/h1-13,21H,19H2
charge 0 multiplicity 1
43 atoms
S  6.680314 0.721891 -0.659453
O  7.302987 -0.682421 -0.115043
O  7.110975 1.408243 -2.073029
N  7.023697 1.977169 0.647455
N  0.61132 0.294411 -0.684958
N  -3.379233 0.279666 -0.063448
N  0.075141 -0.766911 -0.123236
N  -2.042575 0.33009 -0.193813
N  -3.253088 -2.261495 0.406076
C  4.808384 0.566425 -0.638855
C  4.06473 1.41919 -1.471642
C  4.236276 -0.40936 0.198448
C  2.040512 0.31302 -0.624702
C  2.662521 1.28872 -1.451797
C  2.835747 -0.53438 0.20281
C  -4.144372 1.462973 -0.157015
C  -1.329838 -0.812078 -0.037815
C  -1.877972 -2.148304 0.286394
C  -5.553222 1.358905 -0.007026
C  -3.537996 2.724794 -0.398107
C  -1.033866 -3.283929 0.458832
C  -6.351823 2.517129 -0.097905
C  -4.350112 3.871591 -0.485937
C  -5.756617 3.778407 -0.33703
C  -1.6109 -4.530698 0.755075
C  -3.019711 -4.63853 0.877823
C  -3.795942 -3.477577 0.694272
H  4.568352 2.140771 -2.12203
H  4.876409 -1.055484 0.807775
H  2.022887 1.925071 -2.070787
H  2.335458 -1.271114 0.837733
H  7.604083 1.527023 1.374878
H  7.487637 2.78406 0.19768
H  -6.012839 0.380622 0.177984
H  -2.451794 2.775466 -0.510963
H  -3.790872 -0.688573 0.135648
H  0.044314 -3.150163 0.351801
H  -7.438019 2.43524 0.01806
H  -3.885267 4.846137 -0.671811
H  -6.37906 4.676695 -0.406846
H  -0.975523 -5.412471 0.888621
H  -3.502285 -5.592993 1.106068
H  -4.887514 -3.509531 0.77622
