program: Gaussian 09
title: 000257763
version: EM64L-G09RevD.01
frameworkgroup: C1[X(C8H9N7O3S)]
method: RPBEPBE
basis: SDD
operation: Freq
keyword: #p
keyword: freq=noraman
keyword: PBEPBE/SDD
title: #p freq=noraman PBEPBE/SDD
converged: YES YES NO NO
title: Mulliken charges:
elementType: S O O O N N N N N N N C C C C C C C C H H H H H H H H H
charge: 0.951307 -0.533363 -0.534593 -0.308729 -0.288923 -0.718143 -0.024970 -0.176554 -0.079670 -0.341113 -0.497155 0.427872 -0.048769 -0.322411 -0.337977 -0.241400 -0.219761 0.130601 0.247573 0.334879 0.302617 0.288330 0.290073 0.338688 0.339258 0.381949 0.312443 0.327941
chargesum: 0.00000
title: Mulliken charges with hydrogens summed into heavy atoms:
elementType: S O O O N N N N N N N C C C C C C C C
charge: 0.951307 -0.533363 -0.534593 -0.308729 -0.288923 -0.040197 -0.024970 -0.176554 -0.079670 0.040836 0.143229 0.427872 -0.048769 0.012469 -0.035360 0.046930 0.070311 0.130601 0.247573
polarizability: 2.88093314e+02 8.95112654e+00 1.86519874e+02 6.33088639e+00 -5.01342742e+00 9.14331160e+01
1716.lowfreq: -5.9225 -0.0008 -0.0005 0.0008 3.9461 5.2277 17.0296 32.4246 45.1302
frequency: 16.7535 32.3176 45.1094 67.1510 78.0563 116.1735 125.9005 135.1764 145.8653 172.0677 178.7068 194.3214 215.5593 254.9200 269.5648 291.4588 311.1061 341.4418 355.8212 370.2390 392.7985 413.4861 439.8444 464.9319 484.4002 528.5090 553.8128 618.6587 632.8689 665.6391 699.0100 709.2250 734.8048 743.2686 765.4021 794.7032 806.7621 835.6447 854.3820 879.2846 890.1465 910.2791 953.1129 983.4941 990.3763 1003.7252 1011.7763 1018.7339 1061.0036 1072.2404 1088.4621 1130.6800 1163.9280 1200.4503 1224.0466 1252.5820 1273.7825 1305.8349 1328.9593 1390.4324 1398.7226 1427.5822 1477.5342 1486.5264 1533.6621 1586.2719 1593.3295 1602.9888 1667.4271 3113.0591 3163.1729 3165.7171 3196.9072 3368.2889 3401.6407 3474.9326 3532.2185 3535.8199
redmass: 6.7239 4.8123 5.6422 7.0366 7.8054 1.4810 6.6601 5.2983 6.2661 1.5015 3.5911 10.1721 7.4505 5.6563 2.5254 7.8349 8.1402 5.2288 9.0382 5.1337 5.8702 3.0557 11.2704 6.0773 4.4020 5.4145 4.3589 7.1875 10.0945 11.1859 3.6330 1.3365 5.5280 5.4774 1.5429 2.0066 5.3447 5.7964 1.3718 1.4243 7.2859 3.9674 13.2230 7.5456 1.3636 10.4131 4.9080 1.3475 2.3829 1.5072 4.3971 1.3638 7.5730 1.2122 3.6283 3.9764 1.2381 1.4651 4.2022 7.6529 4.7494 3.2804 2.1057 2.2351 1.0851 7.9606 6.1207 6.5439 1.1070 1.0957 1.0912 1.0940 1.0952 1.0414 1.0430 1.0806 1.1000 1.1004
irintensity: 2.4820 2.1446 2.0708 2.4453 1.0769 35.5782 6.0176 6.2758 12.6195 74.6535 35.0971 0.5637 0.8826 3.1176 5.3376 7.3234 17.1796 31.9485 47.6384 39.2111 6.4835 1.9492 36.5532 43.8216 114.5068 25.5326 51.7071 1.1072 2.6784 8.3730 13.6190 171.3890 3.5422 25.4332 418.0423 57.7226 221.1619 88.1096 15.2196 48.1133 8.2862 58.3899 5.5931 3.8497 1.6404 12.4765 4.8638 10.6148 39.4919 24.4814 12.2670 5.9877 4.3156 1.8664 1.8242 24.9875 15.0162 17.6298 30.9608 7.7155 24.1577 1.4555 167.1452 21.3585 22.6468 153.6930 10.8306 19.0358 23.9599 138.2612 2.7243 2.8500 1.3050 34.4851 15.8718 84.6192 17.4536 27.4535
temp: 298.150 k
press: 1.00000 atm
elementType: 16 8 8 8 7 7 7 7 7 7 7 6 6 6 6 6 6 6 6 1 1 1 1 1 1 1 1 1
symmnumber: 1
zpe: 494745.5 jmol-1
zpe.correction: 0.188439 hartree
zpe.thermalcorrener: 0.206958 hartree
zpe.thermalcorrenthalpy: 0.207902 hartree
zpe.thermalcorrgfe: 0.139700 hartree
zpe.sumelectzpe: -1315.601844 hartree
zpe.sumelectthermal: -1315.583325 hartree
zpe.sumelectthermalent: -1315.582381 hartree
zpe.sumelectthermalfe: -1315.650583 hartree
dipole: -1.9389 -1.7960 1.2847
dipole: 2.9386
quadrupole: -117.6876 -124.7192 -118.5733
quadrupole: 20.8020 26.7286 -1.3622
quadrupole: 2.6391 -4.3925 1.7534 20.8020 26.7286 -1.3622
hfenergy: -1315.7902828 hartree
pointgroup: C01 [X(C8H9N7O3S1)]
dipole: -0.7166151 0.6759067 -0.6052001 debye
polarizability: 286.3616895|-16.6336711|184.8801461|-5.4011878|-18.094664|94.8044687 unknown
InChI: InChI=1S/C8H9N7O3S/c9-11-8(16)7-12-13-14-15(7)5-1-3-6(4-2-5)19(10,17)18/h1-4,11H,9-10H2
charge 0 multiplicity 1
28 atoms
S  4.470649 0.269279 0.031672
O  4.663278 1.884022 0.105485
O  5.142859 -0.773671 1.085976
O  -2.140455 2.204784 -0.609235
N  -1.51377 -0.889698 -0.031133
N  5.02109 -0.252414 -1.643125
N  -1.869647 -2.266592 0.122583
N  -3.74184 -1.035152 -0.035238
N  -3.206077 -2.314823 0.118104
N  -4.297399 1.574218 -0.016371
N  -4.824425 2.858246 -0.279261
C  -0.103371 -0.576563 -0.023362
C  2.618736 -0.079321 -0.005698
C  0.369951 0.690219 -0.438901
C  0.789161 -1.591796 0.41214
C  1.75805 0.942737 -0.427187
C  2.173475 -1.340179 0.420975
C  -2.689714 -0.164924 -0.124821
C  -2.970438 1.298746 -0.262232
H  -0.335823 1.470328 -0.745046
H  0.397547 -2.558316 0.734107
H  2.153396 1.920313 -0.719503
H  2.884925 -2.09246 0.77484
H  5.403213 0.575138 -2.130356
H  5.707742 -1.017065 -1.533158
H  -4.958887 0.794797 0.087986
H  -5.096968 3.342103 0.586485
H  -4.145355 3.398749 -0.834422
