program: Gaussian 09
title: 000257761
version: EM64L-G09RevD.01
frameworkgroup: C1[X(C18H16N6O2S)]
method: RPBEPBE
basis: SDD
operation: Freq
keyword: #p
keyword: freq=noraman
keyword: PBEPBE/SDD
title: #p freq=noraman PBEPBE/SDD
converged: YES YES NO NO
title: Mulliken charges:
elementType: S O O N N N N N N C C C C C C C C C C C C C C C C C C H H H H H H H H H H H H H H H H
charge: 0.947538 -0.540255 -0.539289 -0.718527 -0.072575 -0.424901 -0.126694 0.052375 0.000268 -0.044982 -0.215800 -0.215751 0.166945 -0.324578 -0.256438 0.289227 -0.110860 0.461650 -0.409700 -0.354505 -0.269222 -0.497855 -0.189074 -0.189724 -0.252845 -0.180071 -0.331746 0.285596 0.281707 0.267278 0.275384 0.335412 0.335509 0.316195 0.228508 0.288829 0.269003 0.280949 0.230685 0.231079 0.233498 0.237487 0.250266
chargesum: 0.00000
title: Mulliken charges with hydrogens summed into heavy atoms:
elementType: S O O N N N N N N C C C C C C C C C C C C C C C C C C
charge: 0.947538 -0.540255 -0.539289 -0.047606 -0.072575 -0.108707 -0.126694 0.052375 0.000268 -0.044982 0.069796 0.065956 0.166945 -0.057300 0.018946 0.289227 -0.110860 0.461650 -0.181192 -0.065675 -0.000219 -0.216907 0.041611 0.041355 -0.019347 0.057416 -0.081480
polarizability: 6.21494459e+02 -4.37997083e+01 3.61093271e+02 -2.08867917e+00 1.69956729e+01 1.48917039e+02
1716.lowfreq: -3.8339 -3.1193 -0.0015 -0.0012 -0.0007 3.1338 9.2377 18.8264 24.5905
frequency: 9.1404 18.7952 24.5335 29.0099 35.0500 43.9747 58.9281 62.2783 91.7579 100.7104 116.1199 132.9082 147.5052 163.8428 201.3520 207.4067 212.7370 243.0340 256.3563 265.0548 291.5056 296.7729 322.9980 347.9139 378.0226 393.2665 406.0327 409.2638 414.3908 424.0267 434.7255 464.2675 469.6449 505.1357 537.1851 555.8975 594.4376 608.0301 613.1655 614.8464 626.5018 655.1628 687.7895 695.8299 706.2866 729.1807 739.5482 765.6026 779.7434 791.6665 808.0071 821.6000 837.4533 846.5749 847.6988 866.2371 891.0585 906.9044 913.4901 932.2708 950.4389 973.3714 982.6899 983.3004 988.0745 990.1101 992.8114 996.6574 996.7862 1018.6200 1021.0154 1044.2746 1064.2174 1068.8650 1085.1335 1106.2741 1115.5405 1135.9010 1162.3601 1172.5394 1179.1278 1194.8085 1208.7882 1272.2278 1274.8331 1281.5670 1304.8831 1317.9846 1332.5415 1338.0762 1382.7100 1388.9981 1402.7620 1404.3560 1428.5217 1448.7178 1454.6836 1477.5151 1482.3411 1526.2659 1531.9332 1542.0116 1574.7302 1578.4474 1590.2296 1602.4830 1608.2314 3108.4753 3118.4371 3136.9747 3138.3578 3149.2209 3153.5314 3157.5635 3157.8573 3168.2586 3175.3623 3177.2205 3177.3483 3184.1351 3366.5746 3367.0244 3534.7379
redmass: 6.3228 5.0936 3.8650 6.5332 4.0000 5.0429 5.6678 5.9761 6.8873 1.5120 6.4400 6.7390 7.8814 6.5114 5.5029 6.5519 6.0272 5.3746 6.1510 2.7416 6.3568 8.9771 5.4855 6.7398 5.6807 3.0786 2.9271 7.1738 3.2691 5.3397 6.4958 6.6328 3.7179 2.9258 3.0287 6.7738 7.1462 6.3012 6.7537 6.9353 3.3947 6.8301 1.8740 2.2282 4.8235 1.8969 3.4716 1.6904 5.2817 2.2980 4.4501 1.7948 1.2674 1.2641 4.5642 1.5758 8.1471 4.0168 1.4264 1.2980 1.4392 1.3599 1.4378 5.2120 4.4241 1.7343 1.3774 2.6391 1.3360 2.6653 3.3159 2.5357 2.5141 1.5275 1.6651 1.3116 1.6674 2.3262 1.7598 1.0687 1.1220 1.7526 1.9462 3.0444 2.8548 1.3300 10.3107 1.4512 6.3995 1.3985 4.9654 6.4653 3.4828 2.3402 2.6523 2.4472 2.2689 2.8070 2.6106 2.1175 1.0865 5.2370 6.6469 5.8838 7.3245 4.7787 6.0765 1.0909 1.0886 1.0869 1.0886 1.0931 1.0890 1.0886 1.0925 1.0985 1.0957 1.0989 1.0976 1.0966 1.0425 1.0736 1.1002
irintensity: 0.3289 0.8196 2.0519 0.2971 0.3852 1.5854 1.0965 0.8478 0.7356 36.4481 1.7347 3.2603 0.3042 7.8915 6.4079 22.8118 2.2298 3.5486 5.0272 5.2758 18.9223 14.2603 3.7759 1.0813 5.4941 1.8075 0.5490 37.5645 10.4963 4.5734 55.9876 33.8633 131.5748 33.7915 83.2663 9.3753 36.8340 23.6202 2.5168 7.2365 14.5619 21.6319 3.7822 81.9343 11.3515 18.4353 0.8653 87.3514 74.2827 37.3124 238.3525 38.9039 0.1366 1.1438 5.3585 56.9629 12.8758 55.7773 8.6946 1.6422 0.1850 0.0478 0.9161 0.1031 0.1896 10.2174 0.0640 14.9610 0.9586 0.4261 12.1261 57.7054 36.2024 48.1584 14.6759 2.0910 26.5720 16.1261 0.7610 0.2070 1.2122 17.5331 1.9952 294.4492 31.1532 1.2367 21.6498 2.6352 359.9931 18.7210 10.5521 5.1048 13.5785 34.6783 67.2099 108.6957 16.5111 147.0440 23.7862 292.3446 20.4331 5.3775 5.1880 3.0247 2.9192 10.6419 35.3473 15.9332 9.3630 0.6905 5.0213 22.7744 1.3295 1.4834 21.2685 41.6436 1.5336 10.2080 2.9651 5.7629 42.5276 39.4811 24.6997
temp: 298.150 k
press: 1.00000 atm
elementType: 16 8 8 7 7 7 7 7 7 6 6 6 6 6 6 6 6 6 6 6 6 6 6 6 6 6 6 1 1 1 1 1 1 1 1 1 1 1 1 1 1 1 1
symmnumber: 1
zpe: 823033.6 jmol-1
zpe.correction: 0.313477 hartree
zpe.thermalcorrener: 0.338463 hartree
zpe.thermalcorrenthalpy: 0.339407 hartree
zpe.thermalcorrgfe: 0.253582 hartree
zpe.sumelectzpe: -1570.370099 hartree
zpe.sumelectthermal: -1570.345113 hartree
zpe.sumelectthermalent: -1570.344168 hartree
zpe.sumelectthermalfe: -1570.429993 hartree
dipole: 5.2344 -0.7645 4.3759
dipole: 6.8653
quadrupole: -175.5188 -146.7468 -168.3923
quadrupole: 2.5411 -14.9994 7.4946
quadrupole: -11.9662 16.8058 -4.8396 2.5411 -14.9994 7.4946
hfenergy: -1570.6835757 hartree
pointgroup: C01 [X(C18H16N6O2S1)]
dipole: -2.0720116 0.7139989 1.5787456 debye
polarizability: 624.3753421|-31.4976403|331.069477|13.2466584|-72.3167834|176.0599506 unknown
InChI: InChI=1S/C18H16N6O2S/c19-27(25,26)17-10-8-16(9-11-17)22-24-18(14-5-4-12-20-13-14)23-21-15-6-2-1-3-7-15/h1-13,21H,19H2
charge 0 multiplicity 1
43 atoms
S  6.672019 0.696906 -0.261767
O  7.284852 -0.691539 0.331048
O  7.17332 1.384027 -1.651103
N  6.901364 1.964079 1.056061
N  0.62589 0.136835 -0.688221
N  -3.405392 0.275915 -0.222859
N  0.044573 -0.791584 0.035388
N  -2.059956 0.243562 -0.330892
N  -3.586052 -3.955563 0.260166
C  4.803145 0.5041 -0.357722
C  4.100894 1.322591 -1.256751
C  4.197572 -0.471664 0.456344
C  2.047755 0.194798 -0.516206
C  2.703192 1.158488 -1.330083
C  2.802735 -0.624611 0.374161
C  -1.923033 -2.151686 0.475508
C  -1.365502 -0.853948 0.001506
C  -4.115351 1.483348 -0.439509
C  -5.525588 1.472571 -0.277321
C  -3.441274 2.672553 -0.820468
C  -1.328399 -2.835183 1.572154
C  -3.037875 -2.776054 -0.15464
C  -6.260186 2.656021 -0.496391
C  -4.191579 3.845234 -1.035329
C  -5.599326 3.847957 -0.875959
C  -1.878304 -4.0574 2.005197
C  -3.013261 -4.573334 1.334381
H  4.632554 2.040576 -1.888497
H  4.810352 -1.100589 1.110104
H  2.093866 1.761565 -2.009875
H  2.277838 -1.370437 0.97751
H  7.443668 1.531596 1.822404
H  7.371455 2.782267 0.634237
H  -3.943713 -0.551608 0.077985
H  -6.041518 0.549643 0.016959
H  -2.355167 2.651883 -0.939364
H  -0.450324 -2.400312 2.057905
H  -3.483461 -2.352847 -1.064631
H  -7.348131 2.646148 -0.370333
H  -3.674586 4.76524 -1.329426
H  -6.172325 4.765414 -1.045361
H  -1.442771 -4.604949 2.846691
H  -3.479372 -5.51291 1.650797
