program: Gaussian 09
title: 000257760
version: EM64L-G09RevD.01
frameworkgroup: C1[X(C14H11Cl2N5O3S)]
method: RPBEPBE
basis: SDD
operation: Freq
keyword: #p
keyword: freq=noraman
keyword: PBEPBE/SDD
title: #p freq=noraman PBEPBE/SDD
converged: NO YES NO NO
title: Mulliken charges:
elementType: Cl Cl S O O O N N N N N C C C C C C C C C C C C C C H H H H H H H H H H H
charge: -0.020050 -0.039147 0.954493 -0.277549 -0.530640 -0.530115 -0.319606 -0.019357 -0.142004 -0.719720 -0.080808 0.445387 -0.054514 0.233431 -0.334966 -0.347348 -0.233110 -0.214555 -0.429055 0.518176 -0.296898 -0.304973 -0.194372 -0.226815 -0.112152 0.324008 0.294194 0.293823 0.291968 0.275675 0.271380 0.295352 0.340242 0.340217 0.284634 0.264777
chargesum: 0.00000
title: Mulliken charges with hydrogens summed into heavy atoms:
elementType: Cl Cl S O O O N N N N N C C C C C C C C C C C C C C
charge: -0.020050 -0.039147 0.954493 -0.277549 -0.530640 -0.530115 -0.319606 -0.019357 -0.142004 -0.039262 -0.080808 0.445387 -0.054514 0.233431 -0.010959 -0.053154 0.060713 0.077413 0.118000 0.518176 -0.296898 -0.009621 0.090262 0.037962 -0.112152
polarizability: 3.47498034e+02 2.82383448e+01 2.51158359e+02 -1.42532739e+01 -7.55720926e+00 1.39655779e+02
1716.lowfreq: -6.6068 -4.0496 -2.4709 -0.0004 0.0017 0.0021 10.9667 21.4541 25.6189
frequency: 10.8105 21.4439 25.6130 32.9909 51.1912 60.6825 83.0248 94.9865 123.1653 128.5717 133.7981 164.4212 165.9703 170.5631 178.6678 194.8200 221.8176 229.7917 266.5322 296.8089 313.2410 334.9012 346.2516 364.0205 369.3845 379.7191 389.4616 413.2376 418.7557 439.6817 457.7125 467.9242 492.1273 543.7709 548.1475 560.6980 615.1252 617.7185 654.6852 670.4206 681.4750 698.7967 703.1228 737.2089 767.4498 791.0745 796.9139 808.1699 813.3608 852.8267 863.8342 872.7796 901.7099 910.6491 921.0173 940.3553 959.9809 974.0001 983.2360 989.7942 1005.5374 1008.5433 1025.4802 1032.7688 1059.9867 1072.1657 1087.3172 1125.7582 1153.1370 1157.2859 1193.6940 1199.6431 1225.5973 1263.3052 1278.0246 1305.2227 1353.8500 1366.4143 1381.6366 1386.0451 1390.4591 1407.2674 1455.1324 1463.1322 1464.6748 1484.6651 1534.0145 1573.4773 1593.1007 1596.1586 1598.1085 3032.6445 3102.2573 3144.1671 3154.6986 3162.1302 3166.5756 3180.6738 3182.6280 3187.5169 3368.5206 3535.7424
redmass: 12.9619 7.9965 11.1568 10.2137 7.7867 4.1293 8.9437 8.1053 7.7425 1.5522 7.4688 9.2438 5.9505 11.9069 10.0205 9.5258 8.0450 9.3966 2.3405 6.4130 5.1444 7.5159 7.5521 9.2174 4.8320 7.9450 8.1450 3.5786 4.3268 3.3693 8.2914 4.8143 4.1963 3.5525 4.2637 5.1242 6.9502 7.1740 6.2188 12.0066 6.7636 4.3031 6.1747 4.0787 7.7281 7.5396 2.1848 4.2258 1.3806 1.3559 1.3887 1.3923 10.0374 4.1047 7.0780 1.3440 9.2973 2.5494 1.4820 5.0059 1.5290 3.5426 4.7845 5.7105 2.1976 1.5034 2.4827 1.4221 6.7783 1.3402 1.1764 2.0518 2.7985 1.3679 2.0252 1.2979 1.6280 2.7463 4.7571 4.8887 7.0481 3.0464 4.2392 1.7706 1.4186 2.9313 1.0849 7.3396 7.6096 5.8549 8.0069 1.0589 1.1059 1.0924 1.0906 1.0906 1.0959 1.0947 1.0948 1.0963 1.0415 1.1004
irintensity: 0.1551 0.9315 0.5709 0.1891 2.3926 1.0228 5.9794 0.7938 2.3323 36.2056 4.7885 5.4249 0.0550 2.7756 1.1727 7.4796 1.4923 0.4064 5.3413 2.4769 0.6666 5.1421 13.4776 17.6174 14.2141 26.0969 1.8400 6.9618 17.5809 8.3773 30.8317 50.7075 89.3118 68.6236 7.3163 4.6602 30.5722 23.7734 11.7811 1.8668 24.9857 1.1149 4.9662 1.0734 53.9525 23.9952 40.0429 214.7214 50.7357 20.6442 19.2437 37.5998 1.5255 52.3217 52.6153 2.8336 57.5678 2.8198 1.0327 5.6878 5.6443 5.3701 56.8295 68.9353 30.1992 26.6770 37.6310 2.8787 0.6581 1.2580 8.7715 83.5561 108.0500 36.2478 9.0990 7.2787 10.5592 9.1292 44.6627 3.3466 19.3825 13.3566 31.5145 178.7290 128.0384 59.1055 24.3221 19.9229 3.1143 7.4535 1.1661 17.4459 3.2345 46.9096 2.6583 2.5766 7.5515 1.5510 0.4172 1.3482 35.4181 27.9691
temp: 298.150 k
press: 1.00000 atm
elementType: 17 17 16 8 8 8 7 7 7 7 7 6 6 6 6 6 6 6 6 6 6 6 6 6 6 1 1 1 1 1 1 1 1 1 1 1
symmnumber: 1
zpe: 624926.6 jmol-1
zpe.correction: 0.238022 hartree
zpe.thermalcorrener: 0.261625 hartree
zpe.thermalcorrenthalpy: 0.262569 hartree
zpe.thermalcorrgfe: 0.180966 hartree
zpe.sumelectzpe: -2355.659387 hartree
zpe.sumelectthermal: -2355.635784 hartree
zpe.sumelectthermalent: -2355.634840 hartree
zpe.sumelectthermalfe: -2355.716443 hartree
dipole: -1.2198 0.4133 5.4598
dipole: 5.6096
quadrupole: -170.9513 -185.4087 -168.2022
quadrupole: -8.9267 -17.4022 1.0129
quadrupole: 3.9028 -10.5546 6.6519 -8.9267 -17.4022 1.0129
hfenergy: -2355.8974089 hartree
pointgroup: C01 [X(C14H11Cl2N5O3S1)]
dipole: 0.5234492 0.7446854 2.0105295 debye
polarizability: 345.6712496|33.3411374|239.8689522|-3.6541671|-37.6796589|152.7719696 unknown
InChI: InChI=1S/C14H11Cl2N5O3S/c15-9-1-6-13(12(16)7-9)24-8-14-18-19-20-21(14)10-2-4-11(5-3-10)25(17,22)23/h1-7H,8,17H2
charge 0 multiplicity 1
36 atoms
Cl -2.083378 3.190908 -0.777794
Cl -7.077326 0.826655 -1.352395
S  5.232436 1.579885 -1.087219
O  -1.543597 0.953239 1.053345
O  6.298063 0.526493 -1.722951
O  4.664134 2.887259 -1.872752
N  0.439995 -1.663418 0.790185
N  0.423896 -3.0621 0.530314
N  -1.423058 -2.479336 1.699312
N  5.96536 2.185238 0.486987
N  -0.70524 -3.525025 1.086275
C  1.555643 -0.877373 0.344323
C  3.74431 0.58633 -0.498046
C  -0.699372 -1.344788 1.505394
C  1.391374 0.496224 0.038342
C  2.808101 -1.524426 0.195607
C  2.511273 1.243616 -0.382882
C  3.923319 -0.781331 -0.234904
C  -1.095751 -0.013073 2.072666
C  -2.844312 0.833381 0.52572
C  -3.24559 1.860527 -0.366075
C  -3.74918 -0.213121 0.823368
C  -4.527035 1.869973 -0.942135
C  -5.041792 -0.216575 0.252566
C  -5.414529 0.824195 -0.616062
H  0.408719 0.975297 0.096188
H  2.893587 -2.592641 0.408808
H  2.415641 2.300202 -0.651645
H  4.899675 -1.253276 -0.381772
H  -1.882142 -0.180786 2.828728
H  -0.235543 0.487683 2.545998
H  -3.453862 -1.047984 1.465627
H  6.92294 1.804065 0.564626
H  5.934731 3.218329 0.480879
H  -4.821194 2.671918 -1.623662
H  -5.737394 -1.028366 0.480338
