program: Gaussian 09
title: 000257757
version: EM64L-G09RevD.01
frameworkgroup: C1[X(C18H18N8O4S2)]
method: RPBEPBE
basis: SDD
operation: Freq
keyword: #p
keyword: freq=noraman
keyword: PBEPBE/SDD
title: #p freq=noraman PBEPBE/SDD
converged: YES YES NO NO
title: Mulliken charges:
elementType: S S O O O O N N N N N N N N C C C C C C C C C C C C C C C C C C H H H H H H H H H H H H H H H H H H
charge: 0.945625 0.946408 -0.541844 -0.538255 -0.538711 -0.542516 -0.127034 -0.126874 -0.127705 -0.127607 -0.648146 -0.648181 -0.716462 -0.717295 -0.050331 -0.050473 -0.003279 -0.003806 0.411847 0.411728 -0.299663 -0.598031 0.195411 0.196555 -0.216542 -0.213091 -0.212313 -0.215126 -0.330740 -0.275364 -0.276415 -0.330965 0.315863 0.225928 0.286663 0.279809 0.278825 0.285167 0.264684 0.256814 0.257272 0.264779 0.344354 0.312920 0.312982 0.345144 0.338087 0.330433 0.332662 0.336811
chargesum: 0.00000
title: Mulliken charges with hydrogens summed into heavy atoms:
elementType: S S O O O O N N N N N N N N C C C C C C C C C C C C C C C C C C
charge: 0.945625 0.946408 -0.541844 -0.538255 -0.538711 -0.542516 -0.127034 -0.126874 -0.127705 -0.127607 0.009129 0.009945 -0.047941 -0.047821 -0.050331 -0.050473 -0.003279 -0.003806 0.411847 0.411728 0.016200 -0.372103 0.195411 0.196555 0.070120 0.066718 0.066511 0.070041 -0.066056 -0.018549 -0.019144 -0.066187
polarizability: 9.09856072e+02 -1.14703542e+00 4.69916901e+02 2.55258202e+00 2.02249492e+00 1.63545812e+02
1716.lowfreq: -2.5658 -0.0021 -0.0019 -0.0017 0.1135 3.0740 8.2889 13.5952 16.7892
frequency: 8.1705 13.4756 16.7888 28.2102 28.9320 33.8561 39.2110 53.5807 58.1704 86.2795 87.6131 111.1268 118.1268 124.7941 134.3033 145.2180 152.6980 154.3218 194.7705 204.5336 214.5190 222.8472 228.4675 234.8606 264.1602 267.7902 280.6296 282.2407 285.5962 299.3518 308.4452 340.1173 350.6546 362.4373 371.6598 380.0211 414.0332 415.4020 418.1159 432.1677 435.3557 445.2516 452.2031 470.0829 473.4258 487.4795 496.2351 510.7623 514.7433 537.1896 544.6332 552.5690 602.3800 615.3209 627.2007 642.1183 655.0536 662.1174 668.0584 711.1296 731.8364 733.8761 741.6603 762.3598 770.1224 793.9034 794.0240 801.8493 808.2651 825.1214 840.5700 841.3888 846.3789 861.7824 863.5976 884.8383 907.5797 908.1653 934.1586 967.1322 978.1632 978.7734 985.0786 985.8566 988.1403 988.7640 1016.2437 1045.1685 1045.9098 1068.4933 1068.9245 1075.0797 1104.6360 1106.4872 1122.1990 1136.9229 1154.2318 1176.0181 1204.6724 1247.4715 1262.1173 1274.2116 1280.4282 1282.3217 1332.6166 1336.1336 1359.6864 1386.6135 1389.5647 1405.2546 1405.9718 1431.4337 1454.4585 1456.2554 1491.4881 1508.2052 1532.6980 1533.8113 1548.4605 1573.6745 1574.5771 1580.9916 1589.4238 1590.3124 1602.9133 1636.5705 3134.5331 3153.5177 3153.8809 3156.2140 3156.5088 3172.8162 3174.6410 3174.9680 3177.3138 3178.2919 3364.0103 3364.7314 3496.3436 3497.6003 3532.0457 3532.6331 3672.3904 3672.9893
redmass: 5.7656 6.0295 9.5316 6.4035 7.1418 4.0947 4.2528 6.8735 5.6523 6.0962 8.1687 2.6151 1.5480 2.2017 7.0740 7.1398 5.8087 9.3105 7.0176 4.6933 7.1105 7.1651 9.1352 5.4457 2.6048 2.4376 7.3857 6.2463 5.7954 9.3912 8.4265 4.5886 6.0590 5.2245 6.0105 5.4713 3.0488 3.0872 8.8473 9.2068 1.8367 2.1317 3.1974 3.3139 2.6414 1.7549 5.1422 4.0434 3.4892 6.6653 3.0203 3.3816 5.0300 7.2038 5.5110 6.9015 1.1729 6.4550 1.1004 8.3314 6.2091 3.3766 3.7584 1.9877 5.8382 2.2521 2.5202 3.7454 3.4976 4.6477 1.2782 1.2594 2.2846 1.6543 1.5861 6.4505 4.1117 4.1065 2.7027 1.4769 1.4298 1.3998 2.0403 2.8104 1.6375 2.0063 1.5674 2.5673 2.5601 1.4697 1.4619 1.5661 1.4361 1.3437 2.4747 2.1453 1.2944 1.6666 2.0865 3.0316 4.9507 1.5053 1.3015 1.3072 8.0733 9.3160 6.0850 6.3179 6.8103 4.2417 4.1952 6.2016 2.3279 2.3038 3.9621 3.3703 1.0858 1.0855 6.5752 5.3034 6.3846 1.5072 6.9953 4.3760 1.5038 5.5393 1.0916 1.0888 1.0890 1.0885 1.0885 1.0906 1.0963 1.0965 1.0960 1.0956 1.0414 1.0414 1.0473 1.0474 1.1000 1.1001 1.1012 1.1013
irintensity: 1.0362 1.6460 0.4460 1.4605 0.7326 0.4324 0.5634 0.0972 0.6268 2.0672 2.3197 19.4430 38.0183 13.8194 2.6981 5.1183 4.2908 2.4743 1.7569 1.8911 15.0759 10.2330 4.1088 6.0358 2.9201 9.0244 52.1931 2.1693 0.0743 1.0343 1.0648 15.4783 12.0907 8.4416 2.2170 3.0147 3.3871 0.7043 172.0300 33.4541 17.9271 174.7825 79.2012 51.2127 61.8035 231.1394 23.8110 75.1828 88.4870 38.0429 153.0884 4.3795 0.2944 1.1859 0.6944 8.5444 218.8578 56.6486 1.6950 0.4006 0.2793 0.8933 0.4375 11.1867 3.8901 41.5203 30.5053 410.9265 218.6904 59.6073 5.2773 4.9819 80.1807 10.5742 98.2136 1.5389 41.5168 78.2714 3.8798 12.9566 1.0557 2.2399 0.3436 0.7889 0.6795 1.2004 0.0760 130.9792 34.5868 13.0311 32.5420 105.8803 7.3233 10.7638 163.9026 36.6563 3.4498 2.4680 89.3139 96.7650 5.5130 40.3457 4.7374 32.7182 1176.1345 416.5549 51.8050 15.4459 16.4970 44.6160 28.8789 80.4331 93.2149 14.2304 76.7655 15.1240 16.0393 15.3917 110.2337 33.8379 7.0546 2.7778 19.8846 16.5703 365.1020 1104.1918 26.2997 1.0763 0.9121 1.2893 1.5029 2.9389 2.4196 2.3178 1.5512 1.9901 35.4467 35.0860 176.7875 72.5988 23.6978 23.9491 37.7970 113.9819
temp: 298.150 k
press: 1.00000 atm
elementType: 16 16 8 8 8 8 7 7 7 7 7 7 7 7 6 6 6 6 6 6 6 6 6 6 6 6 6 6 6 6 6 6 1 1 1 1 1 1 1 1 1 1 1 1 1 1 1 1 1 1
symmnumber: 1
zpe: 926821.6 jmol-1
zpe.correction: 0.353008 hartree
zpe.thermalcorrener: 0.385190 hartree
zpe.thermalcorrenthalpy: 0.386134 hartree
zpe.thermalcorrgfe: 0.284306 hartree
zpe.sumelectzpe: -2229.045559 hartree
zpe.sumelectthermal: -2229.013377 hartree
zpe.sumelectthermalent: -2229.012433 hartree
zpe.sumelectthermalfe: -2229.114261 hartree
dipole: -0.5605 8.9330 5.7444
dipole: 10.6353
quadrupole: -259.5833 -153.1730 -210.4922
quadrupole: -6.9164 -0.2751 -17.9819
quadrupole: -51.8338 54.5765 -2.7427 -6.9164 -0.2751 -17.9819
hfenergy: -2229.398567 hartree
pointgroup: C01 [X(C18H18N8O4S2)]
dipole: -0.2341724 -1.7746423 -3.7820361 debye
polarizability: 909.8634545|-0.5284843|381.5478438|-1.3925265|138.8145519|251.9074865 unknown
InChI: InChI=1S/C18H18N8O4S2/c19-15-9-16(20)18(26-24-12-3-7-14(8-4-12)32(22,29)30)10-17(15)25-23-11-1-5-13(6-2-11)31(21,27)28/h1-10H,19-22H2
charge 0 multiplicity 1
50 atoms
S  -7.895269 1.9915 1.7444
S  7.974205 1.875156 1.683958
O  -8.957814 0.77514 1.958329
O  -7.575012 3.115385 2.880053
O  7.819169 2.536725 3.164729
O  9.131413 0.795005 1.296918
N  -2.500842 -1.475998 -0.57173
N  2.510163 -1.540253 -0.529322
N  -2.522716 -0.3506 0.112634
N  2.550674 -0.478456 0.249121
N  -2.452892 -3.719351 -2.052034
N  2.43054 -3.795752 -1.987432
N  -8.478249 2.873465 0.23362
N  8.17938 3.265743 0.490561
C  -6.256682 1.247839 1.204861
C  6.314149 1.134551 1.210562
C  -1.227451 -1.981661 -0.884643
C  1.229515 -2.016956 -0.857485
C  -1.235171 -3.203575 -1.684968
C  1.220256 -3.239515 -1.656814
C  0.005252 -1.421257 -0.491343
C  -0.011626 -3.808525 -2.055888
C  -3.829264 0.120835 0.442457
C  3.864778 0.006433 0.524556
C  -5.081137 1.963348 1.485058
C  6.298581 0.124196 0.230746
C  -6.276636 -0.011362 0.576043
C  5.165131 1.603715 1.868231
C  -3.857268 1.3837 1.097329
C  -5.048713 -0.577458 0.193229
C  5.059682 -0.443825 -0.11221
C  3.929208 1.030854 1.509981
H  0.011707 -0.506904 0.109012
H  -0.018222 -4.725534 -2.655885
H  -5.12615 2.922207 2.010519
H  7.234298 -0.212125 -0.227314
H  -7.226194 -0.53326 0.419911
H  5.24206 2.371004 2.644662
H  -2.904744 1.885949 1.291296
H  -5.010726 -1.557545 -0.289451
H  4.994076 -1.227789 -0.871374
H  2.996339 1.353251 1.982244
H  -3.282698 -3.213233 -1.737051
H  -2.536242 -4.565388 -2.608645
H  2.5022 -4.648712 -2.53506
H  3.267116 -3.316378 -1.649053
H  -9.444769 2.557532 0.046014
H  -8.408783 3.891146 0.401093
H  8.149135 4.152896 1.02031
H  9.073444 3.119737 -0.007735
