program: Gaussian 09
title: 000257751
version: EM64L-G09RevD.01
frameworkgroup: C1[X(C8H9NO5S)]
method: RPBEPBE
basis: SDD
operation: Freq
keyword: #p
keyword: freq=noraman
keyword: PBEPBE/SDD
title: #p freq=noraman PBEPBE/SDD
converged: YES YES NO NO
title: Mulliken charges:
elementType: S O O O O O N C C C C C C C C H H H H H H H H H
charge: 0.442591 -0.284591 -0.224553 -0.205508 -0.330212 -0.342836 0.016807 0.405702 0.228610 -0.278133 0.487688 -0.506895 -0.507863 -0.778163 -0.527607 0.284104 0.303096 0.222015 0.253034 0.252757 0.233936 0.234129 0.251354 0.370539
chargesum: 0.00000
title: Mulliken charges with hydrogens summed into heavy atoms:
elementType: S O O O O O N C C C C C C C C
charge: 0.442591 -0.284591 -0.224553 -0.205508 -0.330212 0.027703 0.016807 0.405702 0.228610 0.005971 0.487688 -0.506895 -0.204768 -0.050356 0.191811
polarizability: 2.18247109e+02 -3.24402562e+00 1.70865500e+02 1.28368786e+00 -2.21794354e+00 6.74538757e+01
1716.lowfreq: -6.5171 -0.0004 0.0015 0.0018 1.7991 8.4270 34.3764 38.4971 61.6227
frequency: 34.3652 38.4561 61.6193 77.4103 105.6619 134.4048 154.8627 160.7959 198.6343 217.9399 225.2688 242.6175 278.3550 293.9650 331.9925 344.4964 353.7598 369.6395 436.8995 449.8702 461.8265 521.4059 548.1031 588.3590 596.5931 683.2789 705.3880 713.9183 734.0617 739.7894 784.0562 891.2123 901.9111 920.9845 1001.3678 1020.1160 1041.8999 1075.3223 1113.8228 1157.4641 1188.5665 1198.5359 1218.4537 1242.9982 1260.3070 1332.5272 1375.9263 1406.8047 1410.1593 1434.0344 1454.7133 1466.0260 1466.7700 1470.9130 1480.5043 1565.2539 1605.8139 2974.3723 2996.3182 3068.6654 3079.7302 3099.3609 3139.2128 3167.0190 3186.4261 3448.7146
redmass: 11.8749 6.0922 5.7950 4.3838 6.1723 5.4290 3.2109 4.2082 1.9668 2.6285 1.0915 2.3506 3.0204 3.3683 3.0965 4.2807 7.0412 5.6953 8.0454 3.3379 7.3447 6.8819 10.7398 5.9945 4.3201 7.4949 14.0273 10.3024 8.0553 3.1826 5.5829 1.4324 1.4427 8.4896 3.4190 1.8767 1.5450 2.8791 1.2559 1.3763 2.2390 12.6758 1.1060 5.5465 1.3456 7.3814 4.6143 1.5662 3.6229 1.2702 1.0461 1.0931 1.1584 1.1353 2.1729 8.3125 7.5446 1.0323 1.0364 1.1049 1.0960 1.1015 1.1007 1.0915 1.0908 1.0685
irintensity: 0.3043 0.2226 0.5335 8.9036 1.4421 3.1755 1.7012 10.5583 5.2005 29.4733 2.2677 4.5808 24.1245 27.0474 16.0350 8.0726 4.5260 0.9434 0.7003 4.7552 3.2621 4.0119 90.7033 3.4825 5.4189 1.4303 83.8185 11.2071 34.9450 0.4133 1.6960 0.2691 41.6064 11.9873 54.5487 40.3338 8.1341 12.4113 0.0769 6.9916 51.4691 472.7028 48.3379 94.5097 13.1460 27.9644 141.5319 5.4621 17.1418 16.8882 12.7727 38.5227 59.2633 53.7478 96.7036 61.4998 33.4722 48.2435 10.9771 34.7541 7.3461 19.2669 15.0173 1.1414 7.5496 27.1988
temp: 298.150 k
press: 1.00000 atm
elementType: 16 8 8 8 8 8 7 6 6 6 6 6 6 6 6 1 1 1 1 1 1 1 1 1
symmnumber: 1
zpe: 433347.4 jmol-1
zpe.correction: 0.165053 hartree
zpe.thermalcorrener: 0.180916 hartree
zpe.thermalcorrenthalpy: 0.181860 hartree
zpe.thermalcorrgfe: 0.120760 hartree
zpe.sumelectzpe: -1137.855373 hartree
zpe.sumelectthermal: -1137.839510 hartree
zpe.sumelectthermalent: -1137.838566 hartree
zpe.sumelectthermalfe: -1137.899666 hartree
dipole: 4.5576 2.2230 0.6005
dipole: 5.1063
quadrupole: -106.8019 -79.2726 -94.3251
quadrupole: -4.0056 5.8499 -0.1163
quadrupole: -13.3354 14.1939 -0.8585 -4.0056 5.8499 -0.1163
hfenergy: -1138.020426 hartree
pointgroup: C01 [X(C8H9N1O5S1)]
dipole: 1.995667 0.2241655 0.0546963 debye
dipolederiv: -0.221591 0.0938415 0.0646769 0.2171303 -0.0636195 0.0410006 0.1622352 -0.1126797 0.1115905 -0.6755921 -0.5870333 -0.0887715 -0.5550465 -1.3211878 -0.1687959 -0.0647155 -0.1991336 -0.323108 -0.6266305 0.1712361 0.0948251 0.3630875 -0.847997 -0.2077879 0.154504 -0.1904981 -0.3130535 -0.9665422 -0.1224772 0.0618147 -0.3159179 -0.4929915 -0.0386595 0.0284199 -0.0583922 -0.2344578 -0.2904786 -0.0473149 0.0908751 -0.4153479 0.6980522 -0.0566075 0.3075901 -0.4768377 -0.0423276 -0.0321757 0.0895475 -0.1348426 0.3510063 -0.8467751 -0.059598 -0.3829025 0.5575983 -0.3491991 1.9871348 -0.2960412 -0.3093544 -0.2592384 1.1432544 0.29715 -0.3400853 0.3074474 0.3029733 0.3829178 0.224902 0.012743 -0.2027828 0.2079908 0.0838585 -0.1164102 0.0234248 0.0173476 -0.9034238 0.3825084 0.2066133 0.2181395 0.0123395 -0.0408426 0.2014334 -0.0679168 -0.0107583 -0.5432674 -0.0902038 0.0218136 -0.0888662 -0.0266033 0.0239487 0.0770883 0.0033621 -0.091888 0.2287306 1.0404803 0.2204174 0.8739888 0.5863456 -0.0072869 0.1757105 -0.0199945 0.0782795 0.9383906 -0.3599092 -0.1745469 -0.4142221 -0.0207756 0.078283 -0.25924 0.0612995 -0.0375881 0.1212639 -0.4616047 -0.143963 0.2281913 -0.2527137 -0.0490167 0.0216545 0.0470451 -0.1473824 -0.0514623 -0.2520255 -0.058163 -0.0844229 -0.0208307 0.0014466 -0.0138079 0.0265067 0.0430631 0.1706861 -0.076519 0.0001202 0.1809008 0.8555039 0.1011733 0.0618687 0.1657411 0.3411315 0.1123847 0.0057389 0.0104473 0.0117404 0.0191809 -0.0301807 0.0041949 -0.0241382 0.1343082 0.1510655 0.045373 0.0141707 -0.028263 0.0499837 -0.029103 -0.0037815 -0.0364675 0.1674728 0.0399577 0.1560475 0.0527759 0.0319702 -0.0666209 -0.051084 0.0180478 -0.0656344 0.083124 0.0487346 -0.0279688 0.0687293 -0.0100753 0.0518408 -0.0085158 0.0701797 0.0301102 -0.0323544 0.0019059 0.0076185 -0.0874208 0.0333846 0.0470331 0.0341209 -0.0740313 0.0025086 0.0220084 0.0714671 0.0976986 0.1167329 -0.0458054 -0.0156796 0.026054 0.0432199 -0.0504895 -0.1071011 0.0156427 0.1686215 -0.0873625 -0.0053809 -0.0410551 0.0096249 -0.092285 0.0292095 -0.0286301 -0.047758 -0.1316952 -0.0060077 -0.0744767 0.0136597 -0.0183561 0.0074657 -0.0095216 0.1247285 0.0886397 -0.0308207 0.053677 -0.0096937 0.331665 0.069174 0.0136467 0.0574506 0.2918211 unknown
polarizability: 209.3368678|-14.5719763|174.9792233|-18.2094683|18.2126322|72.2503931 unknown
InChI: InChI=1S/C8H9NO5S/c1-5-3-8(15-14-12)7(13-2)4-6(5)9(10)11/h3-4,12H,1-2H3
charge 0 multiplicity 1
24 atoms
S  3.068286 -0.516302 -0.501166
O  1.913155 1.948594 0.302855
O  -3.057454 1.798569 1.050217
O  -3.743658 -0.317691 0.576382
O  3.043252 -2.252004 -1.015399
O  3.032312 -3.205522 0.198656
N  -2.816944 0.578465 0.681125
C  -1.047774 -1.106427 -0.033998
C  -1.417358 0.210809 0.368585
C  0.332242 -1.316214 -0.299466
C  0.87587 1.015175 0.22487
C  1.279536 -0.288655 -0.177332
C  -0.474914 1.263325 0.498546
C  -1.991665 -2.28122 -0.194586
C  1.576658 3.315183 0.723253
H  0.670238 -2.309513 -0.607473
H  -0.841464 2.243131 0.811769
H  -1.427521 -3.174827 -0.509524
H  -2.525572 -2.507063 0.744587
H  -2.779412 -2.072313 -0.938849
H  1.144156 3.318113 1.741309
H  0.870933 3.782285 0.011061
H  2.531065 3.85996 0.71839
H  3.999633 -3.46646 0.234087
