program: Gaussian 09
title: 000257744
version: EM64L-G09RevD.01
frameworkgroup: C1[X(C17H18Br2N2O6P2)]
method: RPBEPBE
basis: SDD
operation: Freq
keyword: #p
keyword: freq=noraman
keyword: PBEPBE/SDD
title: #p freq=noraman PBEPBE/SDD
converged: NO YES NO NO
title: Mulliken charges:
elementType: Br Br P P O O O O O O N N C C C C C C C C C C C C C C C C C H H H H H H H H H H H H H H H H H H
charge: 0.014502 0.014502 1.326981 1.326984 -0.473376 -0.464330 -0.473373 -0.464330 -0.526722 -0.526722 -0.878703 -0.878706 0.163874 -0.366165 -0.314330 -0.366177 -0.314324 0.568656 0.568655 -0.411189 -0.411188 -0.336798 -0.336796 -0.147489 -0.147490 -0.171231 -0.171230 -0.238770 -0.238771 0.245907 0.216433 0.226012 0.284546 0.245907 0.216438 0.226009 0.284543 0.351829 0.351829 0.228460 0.228460 0.278214 0.278211 0.251551 0.251550 0.254079 0.254080
chargesum: 0.00000
title: Mulliken charges with hydrogens summed into heavy atoms:
elementType: Br Br P P O O O O O O N N C C C C C C C C C C C C C C C C C
charge: 0.014502 0.014502 1.326981 1.326984 -0.473376 -0.464330 -0.473373 -0.464330 -0.526722 -0.526722 -0.526875 -0.526877 0.163874 0.096174 0.196228 0.096168 0.196228 0.568656 0.568655 -0.182729 -0.182728 -0.058584 -0.058585 0.104061 0.104061 0.082848 0.082850 -0.238770 -0.238771
polarizability: 4.46705605e+02 -5.68960150e+01 2.16753136e+02 -3.26472021e-03 5.59805935e-03 2.33697254e+02
1716.lowfreq: -3.6926 -3.3501 -1.5880 -0.0008 -0.0003 0.0007 7.4773 8.2391 15.1717
frequency: 7.4361 8.1430 15.1605 29.9800 32.7394 45.4723 52.7552 66.5537 73.9982 94.8160 96.3938 114.9868 128.1641 164.3678 179.5070 192.6064 204.1898 207.6841 208.3849 236.4436 253.3366 255.3687 258.4020 286.7103 297.8549 299.5475 322.7347 328.1681 333.6800 346.2904 369.3999 392.2109 393.9177 404.1904 406.1942 417.3187 431.2944 432.0739 469.4482 492.5483 493.3032 522.5903 540.3884 541.1999 589.9430 603.5388 608.1674 619.1342 626.1651 632.9157 643.8454 661.8210 681.4707 705.7976 705.8202 768.7201 768.9614 771.2122 811.1727 811.2003 829.6022 829.7245 868.6130 871.8813 886.4839 897.6158 922.4947 930.1150 941.4201 941.4552 952.3210 956.7947 962.2899 962.4312 979.6390 989.1531 989.2223 1012.5601 1065.4511 1065.4690 1094.8063 1097.9261 1117.4362 1121.2657 1121.5649 1157.0079 1158.9619 1196.0794 1196.1040 1214.3716 1218.8197 1244.7720 1245.3772 1271.1841 1298.0008 1298.1903 1323.8419 1326.9466 1328.3587 1339.5522 1344.8129 1360.2415 1378.2136 1393.4547 1393.4687 1435.6955 1435.7849 1440.8943 1441.6209 1452.2437 1464.5524 1477.0515 1478.0710 1587.4660 1587.4732 1605.2382 1605.6934 2968.9922 2974.2435 2992.3751 2995.5163 3065.1478 3070.8051 3115.7853 3115.9923 3127.9505 3127.9613 3148.2737 3148.2833 3169.9216 3169.9285 3174.2064 3174.2244 3527.7488 3527.7863
redmass: 18.1446 14.6918 16.7098 3.7156 3.8544 6.6039 7.8935 6.6089 9.1978 6.6563 10.9478 6.0000 6.7531 5.3406 3.9512 8.2409 11.3508 4.9388 11.8375 3.2955 9.2968 6.7554 6.0208 7.1987 5.2304 5.4607 6.5391 7.6136 7.0660 3.4775 2.4207 3.1002 4.1693 3.3167 3.0187 5.6745 9.2243 8.0133 4.0982 1.9068 2.0538 5.6406 1.9229 1.9636 6.1322 7.1146 6.7732 6.2877 6.8047 7.2885 6.9682 8.5347 5.3326 3.2697 3.2742 5.9086 4.4567 4.8466 1.3198 1.3202 1.5578 1.5626 5.2152 5.1921 2.5760 3.2399 2.3984 4.2078 1.3651 1.3654 8.1783 2.2312 1.3659 1.3861 3.8670 4.8143 4.7817 2.6336 2.5381 2.5334 15.4951 15.8042 3.0530 1.3725 1.4584 2.1238 1.7626 1.1154 1.1154 1.0915 1.0525 2.0865 2.0655 1.4025 1.4062 1.4047 1.6830 2.3775 1.9948 1.3211 1.1977 1.2812 1.2548 4.1786 4.1634 1.8964 1.8982 1.0788 1.0765 1.0848 1.1053 2.4659 2.4371 6.4035 6.4011 6.1688 6.1556 1.0625 1.0650 1.0658 1.0673 1.1002 1.1014 1.0985 1.0992 1.0900 1.0900 1.0901 1.0901 1.0951 1.0951 1.0965 1.0965 1.0754 1.0754
irintensity: 0.0640 0.0832 0.0000 0.0128 0.2448 3.5605 0.3987 3.2788 0.4155 3.1368 2.3846 0.8484 0.0788 1.0216 5.8141 0.0224 1.1850 8.1622 0.0627 0.0709 5.7239 2.8291 0.2874 0.0036 8.6259 0.0022 45.9497 2.0375 112.0615 0.8057 6.5361 2.4753 9.7200 1.1776 0.7377 25.9077 9.7657 86.2730 6.5871 122.8883 21.9032 11.5271 12.7519 14.7216 90.8034 0.4163 65.3054 4.3812 5.6052 1.4261 298.4021 78.1226 93.1787 0.0717 0.6049 225.9069 2.6337 10.4992 38.0012 4.0997 114.2609 15.2112 418.4180 0.3500 0.1571 22.4223 56.6741 0.0120 1.0474 0.0149 488.8932 4.9354 0.3353 0.5539 28.3629 82.3999 3.7453 46.6213 46.1306 2.0710 213.1074 94.9698 20.0474 28.5664 5.7130 3.6582 3.3358 17.8481 1.0357 3.0513 0.4437 174.6773 1.3887 1.2386 113.3626 0.5013 145.0930 0.0800 127.2679 4.8349 1.4749 11.5145 3.7091 0.3814 33.9301 39.8376 8.3518 12.0995 3.1904 4.5512 21.4833 569.4209 11.0842 1.1370 0.9722 109.2936 0.4414 3.9034 59.8539 37.4759 12.9669 2.8677 39.3780 3.6583 1.1307 13.8633 11.5613 5.6152 0.7404 6.8248 4.0708 0.0965 0.0695 17.0302 49.0475
temp: 298.150 k
press: 1.00000 atm
elementType: 35 35 15 15 8 8 8 8 8 8 7 7 6 6 6 6 6 6 6 6 6 6 6 6 6 6 6 6 6 1 1 1 1 1 1 1 1 1 1 1 1 1 1 1 1 1 1
symmnumber: 1
zpe: 880213.8 jmol-1
zpe.correction: 0.335256 hartree
zpe.thermalcorrener: 0.363968 hartree
zpe.thermalcorrenthalpy: 0.364913 hartree
zpe.thermalcorrgfe: 0.269825 hartree
zpe.sumelectzpe: -1926.650445 hartree
zpe.sumelectthermal: -1926.621733 hartree
zpe.sumelectthermalent: -1926.620789 hartree
zpe.sumelectthermalfe: -1926.715876 hartree
dipole: -0.0001 0.0003 9.6519
dipole: 9.6519
quadrupole: -229.3180 -235.1291 -188.1432
quadrupole: -2.2570 0.0003 0.0018
quadrupole: -11.7879 -17.5990 29.3869 -2.2570 0.0003 0.0018
hfenergy: -1926.9857011 hartree
pointgroup: C01 [X(C17H18Br2N2O6P2)]
dipole: 0.0000738 0.0010884 3.7973371 debye
polarizability: 432.5345351|-79.3410936|230.924203|0.0263019|-0.0044778|233.6972569 unknown
InChI: InChI=1S/C17H18Br2N2O6P2/c18-13-1-5-15(6-2-13)20-28(22)24-9-17(10-25-28)11-26-29(23,27-12-17)21-16-7-3-14(19)4-8-16/h1-8,20-21H,9-12H2
charge 0 multiplicity 1
47 atoms
Br -8.779144 1.877247 -0.828632
Br 8.779096 -1.877621 -0.827609
P  -2.380016 -1.838632 -0.292168
P  2.379936 1.838511 -0.293281
O  -1.196233 -2.23223 0.935661
O  -1.731791 -0.409538 -1.0415
O  1.196162 2.232789 0.934343
O  1.731723 0.408974 -1.041779
O  -2.630291 -2.991069 -1.33505
O  2.630177 2.990345 -1.336838
N  -3.667432 -1.275867 0.747324
N  3.667372 1.27638 0.746529
C  -0.000006 0.000207 0.734142
C  -0.583591 -1.094652 1.669535
C  -1.127594 0.610121 -0.140478
C  0.583616 1.095596 1.668896
C  1.127538 -0.610186 -0.140193
C  -4.837279 -0.56386 0.350104
C  4.837221 0.564148 0.349724
C  -5.90849 -0.441747 1.273233
C  5.908395 0.442493 1.272957
C  -4.947533 0.038654 -0.930334
C  4.947513 -0.039032 -0.930398
C  -7.070597 0.280185 0.929989
C  7.070504 -0.279634 0.930128
C  -6.112094 0.755514 -1.276477
C  6.112074 -0.756092 -1.276127
C  -7.163126 0.874754 -0.344718
C  7.163071 -0.874864 -0.344268
H  0.204132 -1.57411 2.276162
H  -1.338489 -0.639686 2.343847
H  -1.916781 1.051846 0.500692
H  -0.740929 1.373203 -0.832007
H  -0.204074 1.575361 2.275323
H  1.33859 0.641035 2.343394
H  1.916738 -1.051603 0.501174
H  0.740819 -1.373625 -0.831298
H  -3.711992 -1.745854 1.656164
H  3.711929 1.746898 1.655094
H  -5.842988 -0.911541 2.26203
H  5.842863 0.912797 2.261509
H  -4.134284 -0.040606 -1.659315
H  4.134296 0.039864 -1.659455
H  -7.891358 0.3697 1.647321
H  7.891237 -0.368788 1.647537
H  -6.192117 1.214186 -2.266091
H  6.192126 -1.215276 -2.2655
