program: Gaussian 09
title: 000257742
version: EM64L-G09RevD.01
frameworkgroup: C1[X(C9H18Cl2N2O6P2)]
method: RPBEPBE
basis: SDD
operation: Freq
keyword: #p
keyword: freq=noraman
keyword: PBEPBE/SDD
title: #p freq=noraman PBEPBE/SDD
converged: YES YES NO NO
title: Mulliken charges:
elementType: Cl Cl P P O O O O O O N N C C C C C C C C C H H H H H H H H H H H H H H H H H H
charge: -0.046579 -0.046578 1.333690 1.333690 -0.472838 -0.467382 -0.472837 -0.467384 -0.544360 -0.544358 -0.737889 -0.737890 0.158372 -0.357198 -0.306601 -0.357197 -0.306600 -0.271466 -0.271462 -0.547838 -0.547842 0.239760 0.218006 0.205872 0.285790 0.239761 0.218007 0.205870 0.285789 0.343933 0.343932 0.264174 0.258824 0.264173 0.258825 0.265435 0.257482 0.265434 0.257482
chargesum: 0.00000
title: Mulliken charges with hydrogens summed into heavy atoms:
elementType: Cl Cl P P O O O O O O N N C C C C C C C C C
charge: -0.046579 -0.046578 1.333690 1.333690 -0.472838 -0.467382 -0.472837 -0.467384 -0.544360 -0.544358 -0.393956 -0.393958 0.158372 0.100568 0.185060 0.100571 0.185059 0.251532 0.251536 -0.024921 -0.024926
polarizability: 2.43038583e+02 -1.13776845e+01 1.80883313e+02 -3.25835751e-04 2.23308338e-03 1.52187167e+02
1716.lowfreq: -9.5877 0.0021 0.0022 0.0024 5.6853 6.9696 13.3334 16.0365 23.6211
frequency: 12.9868 15.0447 23.6004 36.2843 41.2724 58.4889 65.2615 66.7516 87.5002 112.7890 117.7156 145.0232 164.1664 185.1640 210.3800 212.7466 217.0809 227.2945 239.9815 261.2314 261.5228 264.4902 299.6388 330.9308 376.8190 383.0964 383.1731 394.2158 396.7574 419.9309 427.8308 428.5556 471.7007 518.4095 532.2586 534.3916 581.5838 602.0491 639.9283 665.3907 675.4533 687.0224 690.9163 764.0860 766.4694 771.4642 804.2995 806.6798 881.1645 901.4332 925.6221 933.8730 956.1545 957.6032 981.0583 1015.0947 1018.7692 1018.9463 1045.4594 1046.8697 1073.1185 1075.9021 1098.5669 1098.9590 1116.1499 1154.0436 1154.0997 1156.5601 1157.9667 1210.7420 1215.8381 1252.7140 1252.8210 1267.4997 1286.5772 1286.5842 1327.8098 1328.8125 1339.7146 1354.0334 1357.0336 1357.3212 1374.1259 1401.5029 1401.6750 1444.1130 1446.9145 1451.4747 1451.9223 1454.0398 1467.5921 1475.6793 1475.6919 2973.1813 2977.8970 2988.9992 2992.5380 3006.5843 3006.6382 3054.9598 3054.9957 3064.6171 3070.1369 3078.7910 3078.8018 3112.8934 3113.0836 3143.3122 3143.3358 3512.0109 3512.0680
redmass: 8.7161 11.8091 15.9292 2.4525 2.2405 6.8867 5.8446 3.8635 5.3669 7.8052 3.9832 5.1092 4.5982 5.3062 7.0191 6.2576 6.3534 3.0692 5.4024 3.6746 9.1646 4.7158 5.1973 4.0187 5.0531 5.7793 3.6139 3.1284 3.5064 5.1377 5.0264 5.9845 5.1359 5.8784 1.5757 1.5791 7.4456 7.3079 5.6049 8.9030 5.8649 6.1879 5.9368 1.6016 1.5199 3.8133 1.8954 2.0342 2.5607 2.5910 2.8774 3.9496 8.2179 2.3040 3.4545 2.8571 1.3360 1.3489 5.7089 5.6025 5.6087 5.3824 6.5608 6.9799 3.2181 1.2236 1.2150 2.0184 1.7316 1.0571 1.0966 1.1692 1.1673 1.3955 1.1295 1.1295 1.5303 1.2961 1.1787 1.2906 1.2489 1.2536 1.2746 1.2394 1.2395 1.0768 1.0774 1.0898 1.0914 1.0834 1.0924 1.0777 1.0777 1.0618 1.0639 1.0656 1.0669 1.0627 1.0627 1.0573 1.0573 1.1008 1.1019 1.1021 1.1021 1.0980 1.0987 1.1116 1.1116 1.0754 1.0754
irintensity: 0.2877 0.6483 0.0027 4.9600 0.0969 4.9722 0.0429 2.2352 5.4738 3.8042 0.6682 1.3419 0.1131 1.3560 8.6292 1.1547 13.3146 0.5564 3.9136 0.9498 10.6678 1.6163 24.0140 0.3121 96.4942 14.4338 51.0602 0.2997 15.8804 0.7461 3.1933 9.0632 5.7568 2.4690 72.4767 105.6554 64.0856 6.3943 117.2659 83.8601 12.9680 3.0912 145.7402 305.6699 7.3823 0.4058 185.6707 3.3286 7.1445 12.4734 53.1431 0.0517 432.9057 3.2602 20.9723 52.7365 22.9124 2.0351 134.9629 0.9781 102.2108 46.8841 222.4412 66.6485 28.5117 0.6585 18.8613 3.3723 1.0528 0.2533 1.4045 8.0524 3.0782 1.8783 16.5699 3.2075 5.2417 2.0463 2.2712 12.3426 0.0873 10.9329 4.3412 0.3585 57.2411 2.7220 12.2660 5.5734 3.5857 3.3009 12.7339 4.1556 24.0134 0.9298 56.2422 53.9172 22.6109 37.5284 3.3747 18.9010 28.7860 2.8926 33.9880 4.9993 1.6890 3.9167 2.0900 34.3024 7.4397 18.8722 32.2153
temp: 298.150 k
press: 1.00000 atm
elementType: 17 17 15 15 8 8 8 8 8 8 7 7 6 6 6 6 6 6 6 6 6 1 1 1 1 1 1 1 1 1 1 1 1 1 1 1 1 1 1
symmnumber: 1
zpe: 763901.3 jmol-1
zpe.correction: 0.290955 hartree
zpe.thermalcorrener: 0.315147 hartree
zpe.thermalcorrenthalpy: 0.316092 hartree
zpe.thermalcorrgfe: 0.232615 hartree
zpe.sumelectzpe: -2515.445922 hartree
zpe.sumelectthermal: -2515.421729 hartree
zpe.sumelectthermalent: -2515.420785 hartree
zpe.sumelectthermalfe: -2515.504261 hartree
dipole: 0.0002 -0.0007 9.6304
dipole: 9.6304
quadrupole: -166.5480 -184.5055 -156.4627
quadrupole: 3.2811 -0.0001 -0.0021
quadrupole: 2.6241 -15.3335 12.7094 3.2811 -0.0001 -0.0021
hfenergy: -2515.7368764 hartree
pointgroup: C01 [X(C9H18Cl2N2O6P2)]
dipole: 0.0000596 0.0002949 -3.7888796 debye
polarizability: 241.2890892|15.333989|182.6328062|0.0001792|0.0022496|152.1871674 unknown
InChI: InChI=1S/C9H18Cl2N2O6P2/c10-1-3-12-20(14)16-5-9(6-17-20)7-18-21(15,19-8-9)13-4-2-11/h12-13H,1-8H2
charge 0 multiplicity 1
39 atoms
Cl -6.596161 -2.021191 -0.068354
Cl 6.596057 2.021282 -0.068156
P  -2.509986 1.649491 0.522497
P  2.509916 -1.649543 0.522216
O  -1.354394 2.133293 -0.699263
O  -1.783786 0.252954 1.262004
O  1.354318 -2.133126 -0.699623
O  1.78374 -0.253112 1.261951
O  -2.82068 2.788972 1.567944
O  2.820584 -2.789205 1.567473
N  -3.772804 0.968828 -0.468425
N  3.772749 -0.968731 -0.468585
C  -0.000027 0.000073 -0.502756
C  -0.675048 1.040959 -1.438683
C  -1.072749 -0.703248 0.371101
C  0.674987 -1.040659 -1.43886
C  1.072707 0.703243 0.371208
C  -4.878005 0.174956 0.125559
C  4.877911 -0.174894 0.125518
C  -5.14526 -1.04278 -0.769487
C  5.145213 1.042896 -0.769439
H  0.067113 1.570044 -2.061846
H  -1.407925 0.528246 -2.094905
H  -1.806751 -1.220391 -0.279574
H  -0.620818 -1.423875 1.068722
H  -0.067176 -1.569629 -2.062117
H  1.407874 -0.52784 -2.094989
H  1.806709 1.220481 -0.279391
H  0.620791 1.423764 1.068949
H  -4.019388 1.526827 -1.292976
H  4.019374 -1.526631 -1.293192
H  -4.575775 -0.162452 1.132075
H  -5.799585 0.776032 0.240029
H  4.575613 0.162449 1.132036
H  5.799488 -0.775972 0.240007
H  -4.288531 -1.731512 -0.7941
H  -5.443357 -0.756993 -1.790126
H  4.288478 1.731621 -0.794071
H  5.443381 0.757171 -1.790075
