program: Gaussian 09
title: 000257737
version: EM64L-G09RevD.01
frameworkgroup: C1[X(C6H6N6)]
method: RPBEPBE
basis: SDD
operation: Freq
keyword: #p
keyword: freq=noraman
keyword: PBEPBE/SDD
title: #p freq=noraman PBEPBE/SDD
converged: NO YES NO NO
title: Mulliken charges:
elementType: N N N N N N C C C C C C H H H H H H
charge: -0.069174 0.067636 0.012375 -0.043073 -0.604142 -0.629377 -0.025607 -0.053835 0.135864 0.165245 -0.385319 -0.382914 0.235510 0.244966 0.333255 0.346068 0.325313 0.327208
chargesum: 0.00000
title: Mulliken charges with hydrogens summed into heavy atoms:
elementType: N N N N N N C C C C C C
charge: -0.069174 0.067636 0.012375 -0.043073 0.075182 0.023144 -0.025607 -0.053835 0.135864 0.165245 -0.149810 -0.137947
polarizability: 1.69339977e+02 -1.49224020e+00 1.20206516e+02 1.66727985e-02 8.06293936e-03 4.26682730e+01
1716.lowfreq: -12.1736 0.0003 0.0003 0.0005 0.2317 9.0222 86.7797 161.1366 199.6149
frequency: 86.7790 161.1359 199.6147 224.6605 330.4632 349.5713 404.3620 432.3010 456.3392 483.7134 509.1957 517.0251 537.1678 554.1667 568.9603 596.7022 614.4486 676.4215 727.6009 762.0935 825.0187 850.5539 895.6389 925.2529 937.7923 976.7056 1045.0026 1081.2469 1198.3238 1256.5881 1291.9559 1323.2118 1343.1131 1359.6977 1401.1838 1447.6496 1461.2185 1514.1143 1525.1630 1560.0214 1604.1439 1624.6371 3104.8591 3157.7663 3529.2109 3554.2688 3690.5619 3704.4193
redmass: 4.6345 5.7943 7.0448 3.5120 4.3128 2.9439 1.1511 3.6865 7.5845 1.2794 4.8006 7.1857 1.4910 7.4795 2.7971 1.2229 2.8819 8.5218 6.1893 6.8812 11.7859 8.3470 1.5684 4.1409 1.4489 2.0550 2.1891 3.5408 6.4510 3.7737 2.5472 3.3765 3.5521 2.6000 2.1538 4.1570 4.5604 3.4955 3.8287 4.0194 1.9440 1.3741 1.0917 1.0919 1.0440 1.0451 1.1053 1.1046
irintensity: 0.2926 5.0801 2.0333 4.3341 2.5725 13.4648 144.0680 8.9116 0.3022 50.3933 3.2888 1.2847 291.2392 5.2998 80.9300 42.6018 18.7850 0.1915 10.3732 1.6483 1.1489 6.7887 14.7984 7.9064 14.5606 16.3454 2.9579 29.2322 7.7201 12.2666 9.3485 26.9334 117.2170 29.9435 15.5455 19.5288 36.5878 72.8008 65.5095 128.7415 428.0671 353.5352 29.5959 21.3076 90.1270 118.4548 63.0091 38.4276
temp: 298.150 k
press: 1.00000 atm
elementType: 7 7 7 7 7 7 6 6 6 6 6 6 1 1 1 1 1 1
symmnumber: 1
zpe: 343220.8 jmol-1
zpe.correction: 0.130726 hartree
zpe.thermalcorrener: 0.139966 hartree
zpe.thermalcorrenthalpy: 0.140910 hartree
zpe.thermalcorrgfe: 0.096540 hartree
zpe.sumelectzpe: -559.915855 hartree
zpe.sumelectthermal: -559.906615 hartree
zpe.sumelectthermalent: -559.905670 hartree
zpe.sumelectthermalfe: -559.950041 hartree
dipole: -5.1854 5.2337 0.0027
dipole: 7.3675
quadrupole: -51.5335 -69.7107 -71.6489
quadrupole: 1.3134 -0.0679 0.0011
quadrupole: 12.7642 -5.4130 -7.3512 1.3134 -0.0679 0.0011
hfenergy: -560.0465808 hartree
pointgroup: C01 [X(C6H6N6)]
dipole: 2.0303692 2.0686676 -0.0082912 debye
dipolederiv: -0.8011725 -0.5253019 0.0020177 0.2510093 -0.3105625 0.0059937 -0.0174016 -0.0102286 -0.2784679 0.0386891 -0.2145282 0.0127218 0.0232615 -0.15013 -0.0016201 0.0058389 -0.0074186 -0.2551421 -0.7893638 -0.0004066 -0.0114085 0.0765348 -0.4651272 0.007429 -0.0124883 0.0065991 -0.211637 -0.3993651 -0.4160938 0.0070647 0.1120051 -0.8997827 0.0194646 -0.0052176 0.0083259 -0.2328445 -0.1899471 0.0173914 0.0096652 0.2745463 -1.4545879 0.0265635 0.0025648 0.0227461 -0.6714335 -1.4627783 -0.4031134 -0.0071364 -0.8056086 -0.3163268 -0.0281703 -0.0003091 -0.0197796 -0.7344431 0.0617981 0.6288813 -0.0166829 -0.1423257 -0.148069 0.0040468 0.0019535 0.0206542 0.1341101 0.4385017 0.1641857 0.001667 0.3890063 0.0001411 0.0118815 -0.0033207 0.0066315 0.1392207 0.2889603 -0.0310416 0.0032579 -0.2930096 1.683014 -0.0450059 0.0105657 -0.039407 0.1647079 1.5661027 0.6150765 0.0130582 0.9865956 0.0640901 0.0265126 0.004455 0.0172375 0.2699595 -0.0149084 0.0802259 -0.0026476 -0.7152529 0.2682934 -0.0230452 0.0160892 -0.0044597 -0.0422902 0.5864433 0.0525652 0.0109365 -0.1696425 0.756447 -0.0240129 0.0133761 -0.0201573 -0.0597855 -0.1179176 0.0803592 -0.0066527 0.0691078 0.0522399 0.0030563 -0.0056618 0.0028611 0.1229255 -0.0672365 -0.083134 -0.001708 -0.071842 0.047628 0.0005223 -0.0002497 0.0008543 0.1263935 0.1987892 -0.0625104 -0.0020524 -0.0401026 0.2556314 0.0021057 -0.0022032 0.0005561 0.3835874 0.1931426 0.0230737 -0.004428 -0.0383517 0.2912197 0.0008267 -0.0028483 0.0011873 0.3639653 0.2912885 0.0272125 -0.0023887 -0.0000389 0.1445808 0.0060641 0.0000499 0.0067814 0.3985974 0.1789738 0.0471584 -0.0052836 0.0941077 0.1813007 0.0073877 -0.0051927 0.0070163 0.3825764 unknown
polarizability: 169.2675025|1.7786269|120.1762866|2.6683976|-1.8599159|42.7709767 unknown
InChI: InChI=1S/C6H6N6/c7-3-1-9-6-4(12-3)5(8)10-2-11-6/h1-2H,7-8H2
charge 0 multiplicity 1
18 atoms
N  1.038313 1.059063 -0.002057
N  0.946236 -1.818791 0.064463
N  -1.442043 -1.745469 0.013074
N  -2.596834 0.422332 -0.06389
N  -1.38609 2.45191 -0.089526
N  3.387524 0.960072 0.050561
C  -0.150308 0.360266 -0.01115
C  -0.230335 -1.071751 0.021686
C  -1.409945 1.085311 -0.055655
C  2.169883 0.312361 0.040537
C  2.098181 -1.139874 0.074046
C  -2.53708 -0.956115 -0.030119
H  3.0219 -1.733042 0.104854
H  -3.506525 -1.464677 -0.032721
H  -2.262266 2.967585 -0.118488
H  -0.481067 2.920629 -0.080302
H  4.262349 0.444832 0.078731
H  3.403408 1.977158 0.023454
