program: Gaussian 09
title: 000257720
version: EM64L-G09RevD.01
frameworkgroup: C1[X(C14H13NO3)]
method: RPBEPBE
basis: SDD
operation: Freq
keyword: #p
keyword: freq=noraman
keyword: PBEPBE/SDD
title: #p freq=noraman PBEPBE/SDD
converged: NO YES NO NO
title: Mulliken charges:
elementType: O O O N C C C C C C C C C C C C C C H H H H H H H H H H H H H
charge: -0.245091 -0.226180 -0.215581 0.019945 0.418747 0.358572 -0.468607 -0.541911 0.201170 0.478858 -0.333360 -0.369940 -0.771686 -0.385328 -0.385818 -0.225502 -0.225512 -0.227950 0.220826 0.220913 0.266279 0.263018 0.285766 0.253648 0.253653 0.214384 0.234946 0.234893 0.231554 0.231572 0.233721
chargesum: 0.00000
title: Mulliken charges with hydrogens summed into heavy atoms:
elementType: O O O N C C C C C C C C C C C C C C
charge: -0.245091 -0.226180 -0.215581 0.019945 0.418747 0.358572 -0.026868 -0.275632 0.201170 0.478858 -0.070341 -0.084174 -0.050000 -0.150382 -0.150925 0.006051 0.006061 0.005771
polarizability: 2.90556081e+02 -1.14961031e+01 1.43468042e+02 7.37868331e-02 3.06108667e-02 1.15579864e+02
1716.lowfreq: -3.7470 -0.0004 0.0002 0.0009 6.6584 7.7246 9.0731 23.3733 32.8551
frequency: 7.7814 23.3673 32.6938 50.1571 82.8721 112.4487 133.3865 208.2830 211.5424 229.8776 257.6306 296.9146 329.0646 342.6523 364.8745 401.1608 413.8334 444.8605 496.5593 526.3873 561.8936 565.0295 576.1204 617.2766 640.1142 668.5681 701.0678 724.1250 725.8383 756.7742 772.2912 821.8878 838.2195 852.8226 877.3781 883.8420 932.9258 958.6868 969.9836 977.2968 980.3199 991.2461 1000.3299 1022.5237 1026.7570 1042.3656 1058.9585 1091.0934 1151.5859 1173.4534 1174.7529 1188.3669 1198.8189 1206.0157 1230.7098 1237.0039 1279.0856 1326.9809 1343.1416 1359.4228 1388.5895 1394.3062 1403.7403 1425.4323 1442.6121 1453.4650 1469.7771 1473.5473 1480.2148 1487.6645 1568.2518 1598.1089 1618.3491 1620.6424 2974.9265 2998.9085 3039.3024 3087.1167 3100.0171 3124.5978 3125.6344 3138.4283 3152.1413 3160.2239 3167.8439 3168.8135 3187.1663
redmass: 3.7656 6.1391 8.5815 5.5240 4.3428 5.4112 6.8731 2.0335 5.6496 1.3450 6.5301 5.5300 3.3615 2.4250 7.9266 2.7887 6.5961 3.0139 3.8551 5.1330 4.9795 3.8629 5.5381 6.3394 6.2498 4.0300 1.9653 3.5850 4.8006 3.5234 3.7852 1.4367 3.8524 1.2480 4.6046 1.4514 1.6159 3.1146 1.4914 1.3943 1.4037 6.0449 1.3336 1.6370 2.1604 1.5462 4.7846 1.5062 1.9513 1.5422 1.0542 1.1232 1.0867 7.0323 2.5014 2.8098 1.7047 1.2692 4.5992 1.5438 8.4317 2.5626 1.8364 2.3672 2.1872 1.0459 2.5379 1.2795 1.2091 2.3993 6.6642 6.1147 6.2084 6.9339 1.0560 1.0362 1.1080 1.0962 1.1015 1.0859 1.0887 1.0917 1.0962 1.0918 1.1016 1.0878 1.0963
irintensity: 0.0121 0.7274 0.0025 0.1258 0.0217 7.4099 3.1486 0.4797 0.9257 0.1880 1.3573 0.4124 0.7856 0.7483 0.2082 0.0016 0.7365 4.7554 8.3134 1.7911 7.7170 0.0217 2.3690 0.1017 38.3062 15.2050 46.2150 18.6814 3.0634 65.6346 18.2135 32.2416 40.1430 0.0290 35.4294 23.4429 4.9867 131.5493 5.0405 0.0200 0.0018 1.4702 0.0646 29.4083 2.9173 9.8378 64.0419 7.0545 207.4540 7.8064 0.0002 8.7735 1.5808 645.2611 1.6281 119.7180 80.2830 0.2538 111.0384 40.7229 0.7724 1.1723 40.5265 1.4616 9.5969 12.3666 20.8811 69.8841 2.5040 6.7935 146.5911 0.7379 7.8949 223.6995 31.7644 12.9674 20.8622 7.0678 21.9731 6.2551 2.9787 12.7776 35.0815 2.5105 22.5838 3.7612 9.1684
temp: 298.150 k
press: 1.00000 atm
elementType: 8 8 8 7 6 6 6 6 6 6 6 6 6 6 6 6 6 6 1 1 1 1 1 1 1 1 1 1 1 1 1
symmnumber: 1
zpe: 626372.1 jmol-1
zpe.correction: 0.238573 hartree
zpe.thermalcorrener: 0.254456 hartree
zpe.thermalcorrenthalpy: 0.255400 hartree
zpe.thermalcorrgfe: 0.191472 hartree
zpe.sumelectzpe: -820.339528 hartree
zpe.sumelectthermal: -820.323645 hartree
zpe.sumelectthermalent: -820.322701 hartree
zpe.sumelectthermalfe: -820.386629 hartree
dipole: -7.1971 0.0161 -0.0035
dipole: 7.1971
quadrupole: -129.0621 -101.6827 -99.0805
quadrupole: 6.2952 -0.0146 0.0219
quadrupole: -19.1203 8.2590 10.8612 6.2952 -0.0146 0.0219
hfenergy: -820.578101 hartree
pointgroup: C01 [X(C14H13N1O3)]
dipole: 2.8314933 0.0172178 0.0097005 debye
polarizability: 290.4620255|12.0577688|143.5489242|0.8081365|0.5639276|115.5930386 unknown
InChI: InChI=1S/C14H13NO3/c1-11-9-13(7-8-14(11)15(16)17)18-10-12-5-3-2-4-6-12/h2-9H,10H2,1H3
charge 0 multiplicity 1
31 atoms
O  0.88716 0.222965 0.005133
O  -5.184916 -1.656576 -0.054428
O  -5.542116 0.589881 -0.007843
N  -4.749522 -0.434937 -0.027014
C  -2.705571 1.092231 0.011881
C  -0.485481 -0.013679 -0.003773
C  1.799057 -0.962344 -0.016072
C  -1.296004 1.149454 0.017737
C  -3.288049 -0.217686 -0.017371
C  3.217545 -0.450072 -0.003113
C  -1.089109 -1.300275 -0.032147
C  -2.48854 -1.385259 -0.038755
C  -3.477827 2.397367 0.03662
C  3.891023 -0.172419 -1.218823
C  3.88803 -0.225193 1.22506
C  5.212473 0.325325 -1.208278
C  5.209509 0.272503 1.239387
C  5.874135 0.548437 0.021762
H  1.58664 -1.549372 -0.931063
H  1.582595 -1.58458 0.874347
H  -0.791182 2.120075 0.039721
H  -0.494529 -2.216694 -0.048745
H  -2.993364 -2.35444 -0.060664
H  -4.137245 2.494164 -0.842403
H  -4.143022 2.457325 0.91459
H  -2.775973 3.248026 0.056703
H  3.377178 -0.340998 -2.172959
H  3.371846 -0.434928 2.169741
H  5.724859 0.537286 -2.152925
H  5.71949 0.443322 2.193618
H  6.899908 0.933392 0.031277
