program: Gaussian 09
title: 000257719
version: EM64L-G09RevD.01
frameworkgroup: C1[X(C14H11N3O2S2)]
method: RPBEPBE
basis: SDD
operation: Freq
keyword: #p
keyword: freq=noraman
keyword: PBEPBE/SDD
title: #p freq=noraman PBEPBE/SDD
converged: YES YES NO NO
title: Mulliken charges:
elementType: S S O O N N N C C C C C C C C C C C C C C H H H H H H H H H H H
charge: 0.322009 0.057888 -0.205159 -0.215912 -0.080171 -0.378950 0.018047 0.674031 -0.516664 -0.399074 -0.549261 -0.322469 0.535066 -0.271770 -0.226792 -0.238382 -0.571029 -0.345083 0.426041 -0.187525 -0.400294 0.274501 0.272421 0.301556 0.230198 0.251890 0.235829 0.275213 0.240044 0.267285 0.240159 0.286359
chargesum: 0.00000
title: Mulliken charges with hydrogens summed into heavy atoms:
elementType: S S O O N N N C C C C C C C C C C C C C C
charge: 0.322009 0.057888 -0.205159 -0.215912 -0.080171 -0.077394 0.018047 0.674031 0.030259 -0.399074 -0.549261 -0.092271 0.535066 -0.019880 0.009036 0.001662 -0.295817 -0.077798 0.426041 0.052634 -0.113935
polarizability: 2.47434658e+02 1.42560901e+01 2.75402892e+02 -6.57664492e+00 1.36024055e+01 1.42607686e+02
1716.lowfreq: -7.8522 -3.5313 -0.0017 0.0009 0.0015 0.8016 17.1739 24.0000 49.0817
frequency: 17.1714 23.9870 49.0747 56.8961 81.1409 103.8033 130.4103 148.6797 179.3504 200.1497 221.8667 237.1569 278.7734 321.5112 328.2139 378.4620 386.0862 389.8602 419.7217 426.6870 440.6780 452.6241 490.9889 513.4457 529.5561 535.8423 549.2289 573.6485 602.3203 654.3253 673.4068 681.3489 686.5765 706.1348 725.3255 748.4981 754.8430 783.5088 809.2098 844.2721 871.4545 897.9910 902.3050 928.2671 931.7430 979.9496 981.1210 993.6854 1013.4721 1022.2771 1042.6299 1085.8955 1093.5804 1097.7743 1128.4643 1137.1881 1176.8345 1187.8619 1218.0444 1220.7903 1261.2905 1271.5615 1281.9877 1330.0839 1356.4469 1371.9695 1387.6463 1393.3023 1403.5799 1443.1911 1445.4376 1456.7843 1474.9952 1490.1819 1516.0540 1589.0764 1591.7139 1598.8522 1628.6844 3014.9600 3078.5480 3119.0601 3142.2572 3152.9361 3155.8796 3157.4569 3164.1423 3177.4851 3196.3389 3571.5501
redmass: 7.3587 7.3200 8.5852 10.7797 7.7967 6.6008 8.5258 5.6706 5.3960 6.9832 5.6057 5.6128 5.6494 5.2584 3.2433 13.5006 6.9534 6.0482 2.1879 3.3009 2.2050 2.9180 7.7913 6.4166 6.2614 5.1316 4.8212 4.1190 5.6237 7.8562 4.8050 3.4351 4.1805 5.4311 2.5075 7.6854 1.6452 6.0862 1.4059 1.3815 5.0379 1.6965 6.4281 1.3828 1.3762 1.3245 5.8113 1.3447 6.0154 2.3340 2.0887 2.0754 2.8302 2.1629 3.5897 1.4813 1.0925 1.2149 7.4753 2.9166 1.7085 1.5449 1.6735 1.9313 2.3212 7.1958 3.4127 1.9606 2.3358 2.9908 2.6024 2.6970 1.1329 2.2153 2.0605 6.8730 4.7210 6.8784 6.8246 1.0602 1.1056 1.0925 1.0857 1.0897 1.0919 1.0925 1.0952 1.1007 1.0955 1.0767
irintensity: 0.5024 1.2060 1.5096 0.2292 2.8116 0.2049 1.9339 0.2429 1.5348 1.2676 1.4931 1.8819 1.7699 1.1953 2.3302 4.0890 13.0088 5.0638 19.5725 1.4777 46.1971 66.0386 6.9208 7.6740 16.5984 11.0684 13.8519 6.7648 6.1063 7.3106 14.1601 15.1803 0.6416 32.4202 16.4314 42.3341 81.4860 9.5725 36.3882 0.5154 10.0018 45.1755 16.2103 4.5559 2.4667 0.0260 7.3522 1.6217 75.9723 33.5054 22.6294 6.9150 137.9892 56.1105 81.3510 23.7731 6.3749 52.4099 144.2548 334.6729 75.7617 6.4172 39.7837 92.4308 165.6382 96.9285 46.9165 9.5517 17.4217 2.2865 5.1877 72.8038 34.9216 60.7886 201.2170 1.2177 4.1364 8.2914 134.0783 26.4128 6.8492 23.9803 1.5602 9.1450 10.2684 6.4714 21.5759 13.4499 2.5420 17.5742
temp: 298.150 k
press: 1.00000 atm
elementType: 16 16 8 8 7 7 7 6 6 6 6 6 6 6 6 6 6 6 6 6 6 1 1 1 1 1 1 1 1 1 1 1
symmnumber: 1
zpe: 599745.2 jmol-1
zpe.correction: 0.228431 hartree
zpe.thermalcorrener: 0.246330 hartree
zpe.thermalcorrenthalpy: 0.247274 hartree
zpe.thermalcorrgfe: 0.180029 hartree
zpe.sumelectzpe: -1649.377370 hartree
zpe.sumelectthermal: -1649.359471 hartree
zpe.sumelectthermalent: -1649.358527 hartree
zpe.sumelectthermalfe: -1649.425772 hartree
dipole: 5.4817 2.5619 2.1871
dipole: 6.4340
quadrupole: -167.3557 -137.2288 -129.3101
quadrupole: 27.0451 -6.3660 4.7992
quadrupole: -22.7241 7.4027 15.3214 27.0451 -6.3660 4.7992
hfenergy: -1649.6058012 hartree
pointgroup: C01 [X(C14H11N3O2S2)]
dipole: -2.2843205 0.9428326 -0.5482269 debye
polarizability: 253.4633754|-15.3487795|256.7499966|-9.5122814|40.9715169|155.2318632 unknown
InChI: InChI=1S/C14H11N3O2S2/c18-17(19)11-5-3-4-10(8-11)15-9-16-12-6-1-2-7-13(12)21-14(16)20/h1-8,15H,9H2
charge 0 multiplicity 1
32 atoms
S  -3.331242 -2.200147 0.004911
S  -1.306531 -3.121389 -2.16287
O  5.597166 0.719818 1.542083
O  4.343271 2.534361 0.968105
N  -1.759384 -0.514248 -1.293564
N  0.378991 0.737377 -1.518601
N  4.564337 1.26054 0.988506
C  -2.561558 0.313906 -0.469202
C  -0.699277 0.059258 -2.196664
C  -3.476441 -0.421142 0.333183
C  -2.017831 -1.885104 -1.24555
C  -2.54606 1.725839 -0.404469
C  1.485074 0.126404 -0.899483
C  -4.359832 0.221219 1.217577
C  -3.434604 2.374379 0.480151
C  -4.328707 1.633193 1.2911
C  2.447662 0.958355 -0.268561
C  1.682635 -1.284591 -0.893306
C  3.571839 0.367424 0.336631
C  2.825695 -1.838123 -0.278893
C  3.793255 -1.026805 0.348358
H  -0.337343 -0.796933 -2.792484
H  -1.19774 0.775657 -2.87233
H  0.303632 1.74732 -1.405828
H  -1.87467 2.320683 -1.030009
H  -5.059038 -0.354649 1.831247
H  -3.429967 3.46766 0.537323
H  2.344225 2.047961 -0.242118
H  -5.006125 2.154116 1.974884
H  0.947146 -1.954001 -1.353713
H  2.954486 -2.925313 -0.286625
H  4.681635 -1.436623 0.833008
