program: Gaussian 09
title: 000257714
version: EM64L-G09RevD.01
frameworkgroup: C1[X(C11H9NO4)]
method: RPBEPBE
basis: SDD
operation: Freq
keyword: #p
keyword: freq=noraman
keyword: PBEPBE/SDD
title: #p freq=noraman PBEPBE/SDD
converged: NO YES NO YES
title: Mulliken charges:
elementType: O O O O N C C C C C C C C C C C H H H H H H H H H
charge: -0.263615 -0.224266 -0.382000 -0.288834 -0.394698 0.166788 0.364823 0.079724 -0.526371 -0.369574 0.126990 0.361847 -0.341173 -0.375495 0.106914 -0.535536 0.256354 0.327300 0.283399 0.296812 0.248518 0.227587 0.249819 0.227586 0.377100
chargesum: 0.00000
title: Mulliken charges with hydrogens summed into heavy atoms:
elementType: O O O O N C C C C C C C C C C C
charge: -0.263615 -0.224266 -0.004899 -0.288834 -0.067398 0.166788 0.364823 0.079724 -0.270017 -0.086175 0.126990 0.361847 -0.044362 -0.126977 0.106914 0.169456
polarizability: 2.48252846e+02 1.81904595e+00 1.44692466e+02 1.55971103e-03 1.85236478e-04 5.95793720e+01
1716.lowfreq: -0.0005 0.0007 0.0008 1.9215 6.6087 9.9524 29.4317 46.6893 84.3693
frequency: 29.2384 46.6881 84.3690 111.0767 138.3573 202.0310 214.8082 223.7716 262.7610 272.2399 315.6902 316.1814 372.0524 400.6821 423.5379 501.1789 503.1584 539.6040 558.3123 579.9551 599.2684 615.4296 652.5152 653.4605 677.9115 716.3047 731.2998 789.7443 795.5314 838.8529 861.4605 897.7161 906.9878 964.0004 989.9033 1000.9703 1042.7958 1098.5505 1112.3273 1139.0434 1161.0731 1170.2961 1211.7153 1242.8856 1262.6092 1290.6676 1337.0720 1371.9288 1401.1871 1414.8607 1438.3892 1469.6464 1473.4061 1476.9830 1522.8138 1556.1835 1569.5376 1594.4930 1627.9040 1640.6243 2971.0034 3063.3624 3132.6911 3149.0449 3151.3013 3160.9864 3171.9501 3491.1785 3554.9737
redmass: 9.2728 6.4025 4.4436 4.5213 5.6635 4.5165 4.9745 1.3201 3.1114 7.5312 5.8229 5.0278 10.3520 6.2529 3.2017 3.2713 7.3840 4.7468 6.3173 6.2786 1.5072 1.9445 5.1878 1.7105 2.8247 6.6849 4.4630 6.1504 2.7308 1.9856 1.7661 6.8273 4.8842 1.3752 1.3390 4.0000 3.5677 2.4623 1.2571 1.5175 1.7485 1.3671 2.0862 2.8160 1.5377 2.3391 2.5057 4.0766 3.5189 4.6522 1.2101 1.0495 1.0593 3.4423 3.3015 8.8647 4.4133 5.9928 7.8124 6.5585 1.0325 1.1045 1.1003 1.0920 1.0886 1.0941 1.0956 1.0634 1.0781
irintensity: 4.4079 0.0138 0.3578 12.5142 0.8928 0.0940 9.4154 0.6406 9.1164 0.5839 3.9656 0.0106 5.2572 4.8724 10.1679 1.1643 12.2770 22.9640 66.1690 4.4649 106.8663 4.4657 9.4061 108.0040 18.8018 4.5778 26.7304 14.4586 24.1228 13.8660 59.4658 22.1130 1.1866 8.7656 1.9154 43.0620 365.3451 42.9198 0.1471 8.9322 160.4579 0.5918 20.6336 196.3843 33.5940 24.9148 37.3176 51.2786 2.8081 42.9888 9.4039 14.7024 44.9626 218.3118 11.6498 115.5937 198.1049 332.0663 349.8662 173.5147 65.7588 41.5821 22.1576 2.2424 1.1178 2.4110 11.3892 32.5657 62.5508
temp: 298.150 k
press: 1.00000 atm
elementType: 8 8 8 8 7 6 6 6 6 6 6 6 6 6 6 6 1 1 1 1 1 1 1 1 1
symmnumber: 1
zpe: 480064.6 jmol-1
zpe.correction: 0.182847 hartree
zpe.thermalcorrener: 0.196513 hartree
zpe.thermalcorrenthalpy: 0.197457 hartree
zpe.thermalcorrgfe: 0.141620 hartree
zpe.sumelectzpe: -779.091954 hartree
zpe.sumelectthermal: -779.078289 hartree
zpe.sumelectthermalent: -779.077344 hartree
zpe.sumelectthermalfe: -779.133181 hartree
dipole: -5.9607 -3.1298 0.0009
dipole: 6.7324
quadrupole: -79.7023 -87.9424 -94.1889
quadrupole: -6.2623 0.0043 0.0067
quadrupole: 7.5756 -0.6646 -6.9110 -6.2623 0.0043 0.0067
hfenergy: -779.2748014 hartree
pointgroup: C01 [X(C11H9N1O4)]
dipole: -2.3451772 1.2311219 0.0154879 debye
dipolederiv: -2.028413 -0.0574514 0.0277589 0.2081083 -0.3067487 -0.003062 0.0230854 0.0010049 -0.2984908 -0.5717215 0.0862428 0.0021635 0.3111146 -0.9934719 0.0066286 -0.0015583 0.0099105 -0.3332322 -0.6031501 0.4336486 -0.0037919 0.6616994 -0.9182755 -0.0017886 -0.0069792 0.0008553 -0.3868723 -1.2380226 -0.2948375 0.0186153 -0.3607907 -0.7724636 0.0120933 0.0213705 0.0122645 -0.3568376 -1.3543986 0.2135165 0.0136239 -0.0676065 -0.4404165 0.0041218 0.0183121 -0.0003235 -0.2556941 -0.6905747 0.1821477 0.0069315 0.0371832 -0.2751472 0.0034511 0.0094332 0.0011495 -0.0409521 0.9027951 0.1720857 -0.0157239 0.3624079 0.3582835 -0.0104281 -0.0189792 -0.0073786 0.0815314 1.099445 0.0022114 -0.0144009 -0.2065387 1.1576879 -0.0138039 -0.0109942 -0.0167459 0.1723399 -0.7632779 -0.0941878 0.0101663 -0.2842574 -0.006016 0.0008709 0.0133504 -0.0021209 -0.2137055 0.2691654 -0.0275709 -0.0048287 0.1157604 0.0993736 -0.0048568 -0.0073213 -0.0026583 -0.0769717 -1.0633338 -0.1422397 0.0179491 0.4631171 -0.6827233 0.0027227 0.007139 0.0122178 -0.0936754 1.7968986 -0.0839114 -0.0245756 -0.5053086 0.2568258 0.0053831 -0.0172832 -0.0010831 0.116241 0.9545656 -0.4905209 -0.0065042 -0.8137115 0.4909626 0.0045224 -0.0012658 -0.0005306 0.0049598 -0.422689 0.1184426 0.0011853 0.3987231 -0.1390785 -0.0074314 -0.0036596 -0.00312 -0.2137442 2.3454229 -0.10544 -0.0319935 -0.2468108 1.2716237 -0.0127802 -0.0309278 -0.0153681 0.227671 0.8453995 0.1188875 -0.010231 0.4953343 0.3035341 -0.0074483 -0.0165717 -0.0016171 0.317612 0.0896285 0.0040139 0.001437 0.0373142 -0.054321 0.0035564 0.0008619 0.0040928 0.1874168 0.131991 0.0358559 0.0023481 -0.0395918 0.2301426 0.0022047 0.0037027 0.0010775 0.3217536 0.121553 0.0621909 -0.0006638 -0.0130756 0.0222471 0.0023804 0.0006295 0.0012173 0.1483017 0.1282757 -0.0576517 0.0015741 -0.0443465 0.0543382 0.0026145 0.0013015 0.0028144 0.1677486 -0.025359 -0.0900645 0.00455 -0.0997454 0.0258362 0.0039886 0.004742 0.0038563 0.1683548 0.0301084 0.0118285 0.0457792 -0.1654252 -0.0208463 -0.1066941 -0.0180477 -0.105713 -0.0761219 -0.1219463 0.0599478 0.0027674 0.1166102 0.0446125 -0.0003693 0.0017906 0.000496 0.1260216 0.0291785 0.0133627 -0.0494989 -0.1614961 -0.013533 0.1096073 0.0203478 0.1032041 -0.0825976 0.1384593 -0.0705068 0.005363 -0.1986678 0.3075737 0.004517 0.0075214 0.0024983 0.3889431 unknown
polarizability: 248.2075498|-1.8395145|144.6679415|-2.9248867|-1.4142007|59.6491929 unknown
InChI: InChI=1S/C11H9NO4/c1-16-6-2-3-7-9(4-6)12-5-8(10(7)13)11(14)15/h2-5,12,14H,1H3
charge 0 multiplicity 1
25 atoms
O  -4.282782 0.651931 0.021489
O  1.55123 -2.171903 -0.020705
O  4.163782 -1.211421 -0.080321
O  4.452135 1.081667 -0.122949
N  0.387997 1.826788 -0.070659
C  -0.20886 -0.529055 -0.021237
C  -0.616178 0.838797 -0.038263
C  1.232842 -0.940072 -0.036507
C  -1.979296 1.204959 -0.023436
C  -1.22292 -1.517488 0.011313
C  2.189519 0.194072 -0.07085
C  -2.962693 0.193863 0.008934
C  1.7183 1.505829 -0.085903
C  -2.585412 -1.180718 0.026577
C  3.669541 0.08777 -0.09226
C  -5.356785 -0.348508 0.055082
H  -2.298181 2.252528 -0.036424
H  0.108262 2.808939 -0.083141
H  -0.895627 -2.562482 0.024275
H  2.437215 2.330843 -0.111137
H  -3.34085 -1.970695 0.051828
H  -5.326508 -0.998362 -0.839877
H  -6.28812 0.235638 0.059226
H  -5.29895 -0.967194 0.97055
H  5.15944 -1.154426 -0.098205
