program: Gaussian 09
title: 000257712
version: EM64L-G09RevD.01
frameworkgroup: C1[X(C8H15NO2)]
method: RPBEPBE
basis: SDD
operation: Freq
keyword: #p
keyword: freq=noraman
keyword: PBEPBE/SDD
title: #p freq=noraman PBEPBE/SDD
converged: YES YES NO NO
title: Mulliken charges:
elementType: O O N C C C C C C C C H H H H H H H H H H H H H H H
charge: -0.285327 -0.249590 -0.419344 0.316056 -0.693639 -0.745294 -0.694683 0.239176 -0.624869 0.275330 -0.770627 0.207548 0.203969 0.266002 0.222934 0.222179 0.221267 0.264739 0.208199 0.204378 0.357908 0.264488 0.257595 0.259104 0.244181 0.248321
chargesum: 0.00000
title: Mulliken charges with hydrogens summed into heavy atoms:
elementType: O O N C C C C C C C C
charge: -0.285327 -0.249590 -0.061436 0.316056 -0.016121 -0.078914 -0.017367 0.239176 -0.102785 0.275330 -0.019021
polarizability: 1.23332753e+02 1.54738528e+00 1.01041697e+02 1.24218106e+00 1.32769469e+00 7.85824008e+01
1716.lowfreq: -15.9847 -5.3992 0.0009 0.0009 0.0010 6.1988 33.5855 51.5616 88.3269
frequency: 33.4635 51.4299 88.3227 117.9281 133.3596 156.6440 185.2756 209.2566 243.3198 259.9301 283.4099 309.5968 332.6113 358.7386 412.7025 427.0508 448.6582 469.5336 553.0280 581.2467 663.3809 757.3837 780.8780 819.3151 872.2333 911.4488 915.4662 926.1506 944.6538 952.1850 993.4411 1020.1297 1033.0465 1040.7586 1153.3555 1186.1532 1218.3174 1233.5929 1236.1415 1265.8866 1309.0535 1370.2815 1371.8437 1374.7647 1398.6469 1423.7627 1441.7795 1449.5415 1451.3586 1467.4859 1469.9037 1471.5780 1482.9990 1501.0905 1526.0322 1604.1977 1634.9620 2977.3152 2980.4732 2981.7922 2983.5203 2986.5234 3063.1960 3070.6459 3077.0542 3080.6045 3091.4860 3092.5951 3100.5635 3104.6349 3126.7454 3371.6641
redmass: 2.8094 4.0732 3.3803 3.4991 2.2311 1.4004 1.0395 3.6758 1.0772 1.0615 3.5371 3.0275 2.3516 3.0779 2.6584 3.0077 2.9426 2.3249 3.6534 3.6306 4.3053 1.3597 2.2996 2.4567 2.4078 2.6638 1.7532 1.6454 2.4112 1.2044 2.2038 1.7985 1.3958 1.4649 1.3965 1.8379 2.5837 2.6404 2.8791 3.6742 1.9116 1.2078 1.2516 1.2054 1.2180 1.0990 1.0729 1.0468 1.0535 1.0522 1.0871 1.0483 1.0541 1.0591 1.6439 6.6700 5.8129 1.0358 1.0431 1.0352 1.0609 1.0361 1.0956 1.1004 1.0999 1.0996 1.0933 1.0985 1.1004 1.0997 1.1003 1.0801
irintensity: 2.0175 2.8764 11.5428 6.2887 0.5583 1.3791 0.1809 12.2265 0.3432 0.1230 1.2525 5.0096 0.8705 0.5717 1.3100 4.5322 0.8569 7.1766 13.5513 11.7347 2.3110 60.3219 20.0624 4.3364 3.2673 3.7569 0.4647 4.1694 1.4730 0.5317 30.3064 18.0053 0.0198 0.4212 57.9667 7.9707 35.1092 63.4895 43.2303 149.2084 28.3562 31.3697 73.6092 37.9428 34.3787 53.7673 16.3207 0.5131 18.7529 4.2816 46.7359 0.9915 8.5536 31.8520 275.1386 7.9314 253.9601 20.4465 0.6853 35.7124 1.9365 24.9840 8.0887 11.8814 41.4035 27.5015 12.6017 54.7706 2.8336 21.0512 12.2929 149.8896
temp: 298.150 k
press: 1.00000 atm
elementType: 8 8 7 6 6 6 6 6 6 6 6 1 1 1 1 1 1 1 1 1 1 1 1 1 1 1
symmnumber: 1
zpe: 576704.8 jmol-1
zpe.correction: 0.219655 hartree
zpe.thermalcorrener: 0.233101 hartree
zpe.thermalcorrenthalpy: 0.234045 hartree
zpe.thermalcorrgfe: 0.179697 hartree
zpe.sumelectzpe: -518.185466 hartree
zpe.sumelectthermal: -518.172020 hartree
zpe.sumelectthermalent: -518.171076 hartree
zpe.sumelectthermalfe: -518.225424 hartree
dipole: 1.8375 -1.2785 -0.3809
dipole: 2.2707
quadrupole: -53.8707 -79.4374 -66.2202
quadrupole: 7.2899 0.5028 -1.9089
quadrupole: 12.6387 -12.9279 0.2892 7.2899 0.5028 -1.9089
hfenergy: -518.4051209 hartree
pointgroup: C01 [X(C8H15N1O2)]
dipole: -0.6151943 -0.5803249 -0.2878427 debye
dipolederiv: -0.681694 -0.173285 -0.0610904 -0.0434532 -0.8197964 -0.3667842 0.1311054 -0.2578013 -0.6160826 -0.7587448 0.1140498 0.0804158 0.0315941 -0.5658114 -0.253486 -0.0450844 -0.2854118 -0.601378 -1.1010474 0.1060063 0.2531434 0.1483819 -0.592988 -0.1560726 0.2983675 -0.0937843 -0.643206 0.7712728 0.006738 -0.1216534 0.0799637 0.3048566 -0.0782317 -0.0940078 -0.0521891 0.3531996 -0.1001749 0.0191193 -0.0103735 0.0014357 0.011729 -0.0176899 -0.0391135 -0.0534293 -0.1370519 -0.0381517 0.0126329 0.0356409 0.0195409 -0.0200814 -0.061371 0.0548142 -0.0548016 -0.0135541 -0.0670302 0.052404 0.0439706 -0.0062962 -0.1442862 0.0313935 0.0416997 0.0418609 -0.0247833 1.3374728 0.2718171 -0.1351153 0.0099115 0.9372505 0.5534354 -0.5557907 0.4151756 0.6294928 -0.6041486 -0.3039433 -0.2056636 -0.3710015 -0.1206179 -0.108477 -0.1932016 -0.1881363 -0.2871075 1.0796962 -0.1669705 0.1608184 -0.0986434 0.4412152 0.3749422 0.4508831 0.4947343 0.7657523 -0.5390824 0.0874618 -0.0855843 0.2263065 0.0093083 0.0243034 -0.117411 -0.0301586 -0.0065654 0.0950148 -0.0178252 -0.0193164 0.0250531 -0.1280859 0.126133 -0.0221099 0.0799128 0.0220393 -0.1865785 -0.061988 0.0291074 -0.0719806 0.0864438 0.0232226 0.0568032 0.0334449 0.0808109 0.1432065 0.0560539 0.0659403 0.0279289 0.0238648 -0.0915781 0.0377803 -0.0582457 0.0065638 0.0293658 -0.0114516 -0.1396852 0.0212836 0.0750101 -0.0077139 -0.1041277 -0.0275646 -0.0939051 -0.1463628 -0.0308814 0.0761248 -0.081662 0.0777455 0.0164919 0.0455267 -0.0044388 0.0830828 0.1100732 -0.0142716 0.0029565 0.0151411 -0.1369579 0.0643308 0.0016921 0.1115062 0.0323627 0.1022633 0.0818393 0.0204571 0.0735216 0.0081413 -0.0535093 0.0121986 -0.1079561 0.0481059 0.0347602 0.0053233 -0.1293367 -0.0081078 0.063327 -0.0153295 -0.1110941 0.03929 -0.1088962 -0.1730919 -0.0866518 0.0645417 -0.0697022 0.0775282 0.0372597 0.0572947 0.032807 0.0781899 0.408832 0.0285001 0.042835 0.1001328 0.2539136 -0.0109158 0.136488 -0.013376 0.2255651 0.1329423 0.0320034 0.0021639 -0.0045232 0.0217361 0.0670703 -0.0075196 0.0393386 0.0463786 -0.0403982 0.0401775 0.0156944 0.0768518 0.0210803 -0.0626617 0.0239254 -0.0307381 0.0999967 0.0483768 -0.0168991 -0.0321598 -0.055065 0.0542668 -0.0950547 -0.0889705 -0.0944884 -0.0001824 0.0631829 -0.0025587 0.0487614 -0.0530928 0.1236204 0.0236719 0.0739956 0.0423107 -0.053221 0.0800455 -0.0274003 -0.002593 0.0064806 -0.0624125 0.0366203 -0.0441438 0.0221392 0.1143928 unknown
polarizability: 122.7410896|4.8920948|90.109031|-2.4048853|11.0299378|90.1067294 unknown
InChI: InChI=1S/C8H15NO2/c1-6(10)5-7(11)9-8(2,3)4/h9H,5H2,1-4H3
charge 0 multiplicity 1
26 atoms
O  0.057577 1.28438 1.576697
O  -1.519748 -1.828375 -0.93422
N  0.668738 -0.444193 0.107499
C  2.079462 -0.026997 -0.173937
C  2.891874 -0.008085 1.147091
C  2.660064 -1.082584 -1.145006
C  2.092666 1.376405 -0.836415
C  -0.205924 0.227746 0.920549
C  -1.613379 -0.421082 1.063291
C  -2.215603 -1.096004 -0.168752
C  -3.690337 -0.855318 -0.432368
H  2.900812 -1.010192 1.612964
H  3.935885 0.291067 0.941573
H  2.450865 0.709966 1.857727
H  2.079614 -1.121761 -2.085828
H  3.703197 -0.825984 -1.398132
H  2.656617 -2.089653 -0.687908
H  1.638936 2.121159 -0.161942
H  1.527253 1.364626 -1.786085
H  3.13261 1.681428 -1.053755
H  0.277411 -1.245168 -0.412757
H  -1.52651 -1.197525 1.852707
H  -2.284711 0.358756 1.45691
H  -4.041817 -1.483373 -1.265028
H  -4.28867 -1.06144 0.474871
H  -3.853783 0.210799 -0.683646
