program: Gaussian 09
title: 000257708
version: EM64L-G09RevD.01
frameworkgroup: C1[X(C7H8F8O)]
method: RPBEPBE
basis: SDD
operation: Freq
keyword: #pfreq=noraman
keyword: PBEPBE/SDD
title: #p freq=noraman PBEPBE/SDD
converged: YES YES NO NO
title: Mulliken charges:
elementType: F F F F F F F F O C C C C C C C H H H H H H H H
charge: -0.167711 -0.160031 -0.147544 -0.124601 -0.130289 -0.177732 -0.161908 -0.167538 -0.483457 0.143163 0.307501 0.235073 0.265665 -0.736157 -0.674354 0.052388 0.260096 0.238138 0.247216 0.257893 0.233487 0.233783 0.278004 0.378914
chargesum: 0.00000
title: Mulliken charges with hydrogens summed into heavy atoms:
elementType: F F F F F F F F O C C C C C C C
charge: -0.167711 -0.160031 -0.147544 -0.124601 -0.130289 -0.177732 -0.161908 -0.167538 -0.104543 0.143163 0.307501 0.235073 0.265665 0.009294 0.050809 0.330392
polarizability: 9.03178853e+01 2.68160366e-01 7.77269270e+01 -1.63301093e+00 -1.57958569e+00 7.92801552e+01
1716.lowfreq: -11.0625 -6.0555 -0.0014 -0.0006 -0.0005 11.5749 50.8523 65.5389 83.9001
frequency: 50.8063 65.5136 83.8947 104.9376 118.4828 158.7424 170.2336 188.9020 209.9399 226.5950 241.6776 254.3965 260.9215 273.5525 284.1712 291.1934 303.4965 314.5008 330.0514 351.0717 374.7267 387.7988 423.5201 445.0483 487.3397 490.5332 536.8747 562.0517 578.4822 598.0626 747.5395 802.7097 871.7704 924.6604 944.7236 962.3758 978.9012 989.7016 1000.4506 1015.0119 1022.3337 1036.2016 1053.2917 1108.6450 1141.3210 1147.4759 1169.7957 1185.4584 1236.8515 1303.1485 1332.5787 1342.1968 1386.8618 1408.9140 1457.8409 1466.4027 1479.6087 1489.0869 3001.1532 3013.9085 3099.2295 3108.3512 3114.3025 3117.8557 3126.8133 3576.9513
redmass: 6.1826 7.3081 9.3841 5.8109 10.2582 7.3776 8.0512 1.1729 3.4431 15.6271 4.8699 11.5009 2.1797 4.2896 5.2854 5.6009 6.6450 4.4206 6.4840 4.1361 1.6610 3.7668 6.3202 3.5419 9.2783 6.4033 4.6339 14.8340 11.2068 5.5318 7.1309 3.9568 6.6044 3.4697 1.5043 4.9222 3.5110 7.5657 7.0466 1.9360 5.0181 10.1884 4.1376 1.9729 8.3746 5.1577 6.3343 2.6330 3.3039 1.2519 1.4329 1.5832 1.2035 1.1901 1.0523 1.0481 1.0534 1.0577 1.0362 1.0354 1.1009 1.0997 1.0899 1.1004 1.1008 1.0664
irintensity: 0.3091 1.1978 3.3273 1.3766 1.0071 7.2072 14.0148 1.4843 21.6075 2.1478 7.3003 0.9432 1.3473 6.9429 1.9821 1.5811 0.8374 29.3417 1.8232 7.0952 129.2777 6.2630 11.5746 19.5966 15.0867 4.9887 8.1501 5.8593 6.9652 9.2065 57.8666 24.4890 168.5156 3.5718 3.6488 97.6247 35.5642 29.3188 29.8020 33.0604 95.5135 239.9296 118.0379 73.5355 11.9150 32.0813 28.3535 19.7235 6.8572 5.9011 17.8544 26.6537 26.1339 20.7227 6.9203 0.9825 8.5102 26.1889 7.3794 8.3855 11.9982 3.2520 0.1045 15.9178 8.9712 25.5145
temp: 298.150 k
press: 1.00000 atm
elementType: 9 9 9 9 9 9 9 9 8 6 6 6 6 6 6 6 1 1 1 1 1 1 1 1
symmnumber: 1
zpe: 396753.1 jmol-1
zpe.correction: 0.151115 hartree
zpe.thermalcorrener: 0.168183 hartree
zpe.thermalcorrenthalpy: 0.169128 hartree
zpe.thermalcorrgfe: 0.107669 hartree
zpe.sumelectzpe: -1144.211439 hartree
zpe.sumelectthermal: -1144.194371 hartree
zpe.sumelectthermalent: -1144.193427 hartree
zpe.sumelectthermalfe: -1144.254885 hartree
dipole: -4.4453 -2.5322 1.9654
dipole: 5.4805
quadrupole: -90.6920 -94.6009 -92.0667
quadrupole: 3.3770 -3.4078 -1.0224
quadrupole: 1.7612 -2.1477 0.3865 3.3770 -3.4078 -1.0224
hfenergy: -1144.3625544 hartree
pointgroup: C01 [X(C7H8F8O1)]
dipole: 1.7872954 -1.0702156 -0.5561861 debye
dipolederiv: -0.4345183 -0.0078089 0.1127412 0.0147429 -0.2967196 -0.0002672 0.1844888 0.0776656 -0.6585747 -0.5052297 -0.1817013 -0.0004826 -0.2182789 -0.6139507 0.0140574 -0.0542266 -0.0577269 -0.2637745 -0.3812945 -0.0056108 0.0993379 -0.0587224 -0.3245165 0.1717281 0.1495402 0.0772918 -0.6158241 -0.3928503 0.1375943 0.0685856 0.1899303 -0.5422765 -0.1880434 0.055828 -0.1128089 -0.3288175 -0.6221476 0.1705925 -0.1173855 0.1544266 -0.3600864 0.070912 -0.1821077 0.1226544 -0.3145896 -0.4519209 0.0861456 0.0415712 0.1617394 -0.4805035 -0.1411487 0.1513998 -0.2324575 -0.4589658 -0.3690557 0.0956508 0.1927071 0.0395652 -0.4210613 -0.1892464 0.1130422 -0.1736065 -0.4951803 -0.5504249 -0.3144854 -0.0614591 -0.2344919 -0.5068077 -0.0685051 -0.0475486 -0.0761765 -0.3163449 -0.8340455 -0.0557991 0.0066052 -0.0861899 -0.7197303 -0.0310112 0.0000334 -0.0094674 -0.2469119 0.4890181 0.1383276 0.0755738 0.1323705 0.4746224 0.0157847 -0.0072861 0.0740982 0.257135 0.8575039 0.2239773 -0.0981079 0.0283331 0.8228388 -0.030842 -0.1163193 -0.0029991 0.8067623 0.6966959 -0.122154 -0.2417044 -0.0578372 0.7968878 0.0155853 -0.0886909 0.0409656 0.9059423 1.0329602 -0.2837117 0.0795463 -0.304449 0.7674217 0.1067482 0.0481205 0.0962207 0.6709087 -0.0408835 -0.0309602 0.0362358 -0.0390813 -0.0513627 -0.0107097 0.0645607 0.048547 -0.139122 -0.0851709 0.0076047 -0.0562759 0.0934048 -0.0265521 0.0536758 -0.0388225 -0.0282387 -0.0689656 0.8728008 0.2111705 -0.0800846 0.2434202 0.9263186 0.266505 -0.1245588 0.1827834 0.8339835 0.0626934 -0.0803536 0.0122411 -0.1011503 -0.0042859 0.0207547 -0.0050208 -0.007595 0.1029393 0.030132 0.0976717 0.0399628 0.119752 -0.0353178 -0.0467842 0.0204213 -0.0047453 0.0759043 -0.0051116 -0.015991 -0.1084096 -0.0145016 0.110628 0.0036828 -0.0864153 0.0175458 0.0043691 0.079379 -0.0241038 0.07242 -0.0117058 0.1182023 0.0248326 0.0318613 0.0311372 -0.0568198 0.0384695 -0.0807743 -0.0171654 -0.1196959 -0.0198719 -0.0015888 0.0006207 0.0215046 0.0994791 0.0242705 0.0886161 0.0074103 0.1045541 -0.0234348 -0.0505148 0.0238593 -0.0709192 0.0670221 0.1237309 -0.0003772 -0.0230378 0.0266218 0.0417844 -0.0090215 -0.075538 0.0028136 0.0432251 0.3649993 -0.0535198 -0.0408255 -0.0627568 0.3677737 0.0034163 -0.0172414 -0.016487 0.0962201 unknown
polarizability: 90.3829811|-0.2495228|78.3139688|-1.4389856|1.704997|78.6280176 unknown
InChI: InChI=1S/C7H8F8O/c1-4(2,16)6(12,13)7(14,15)5(10,11)3(8)9/h3,16H,1-2H3
charge 0 multiplicity 1
24 atoms
F  0.666544 0.368958 1.786485
F  1.96616 1.717877 0.466818
F  0.229484 1.472805 -1.644138
F  -0.712627 2.14475 0.320165
F  -2.437364 0.706348 -1.09783
F  -0.937084 -0.934132 -1.579142
F  -2.375814 0.073067 1.621737
F  -2.824505 -1.713353 0.253751
O  1.036845 -1.832384 0.109725
C  1.946394 -0.669964 -0.013649
C  1.112806 0.57312 0.437659
C  -0.171491 1.023688 -0.352937
C  -1.342771 -0.005269 -0.56332
C  2.478806 -0.512107 -1.45049
C  3.085218 -0.887308 1.001845
C  -1.804024 -0.820089 0.680865
H  3.086859 0.402684 -1.544861
H  3.121725 -1.378011 -1.685563
H  1.667612 -0.45661 -2.196859
H  2.675887 -1.074271 2.00682
H  3.75812 -0.014877 1.043691
H  3.662818 -1.773274 0.691083
H  -0.987514 -1.395148 1.143301
H  0.795817 -2.1672 -0.790755
