program: Gaussian 09
title: 000257707
version: EM64L-G09RevD.01
frameworkgroup: C1[X(C6H10O3S)]
method: RPBEPBE
basis: SDD
operation: Freq
keyword: #p
keyword: freq=noraman
keyword: PBEPBE/SDD
title: #p freq=noraman PBEPBE/SDD
converged: NO YES NO NO
title: Mulliken charges:
elementType: S O O O C C C C C C H H H H H H H H H H
charge: 0.143701 -0.413085 -0.237189 -0.184822 -0.369435 -0.437027 -0.686423 0.188877 -0.001897 -0.714200 0.308863 0.258972 0.299950 0.258595 0.215066 0.234188 0.248817 0.253412 0.255540 0.378097
chargesum: 0.00000
title: Mulliken charges with hydrogens summed into heavy atoms:
elementType: S O O O C C C C C C
charge: 0.143701 -0.034988 -0.237189 -0.184822 -0.060572 0.121895 0.021426 0.188877 -0.001897 0.043569
polarizability: 1.16202840e+02 6.01979144e+00 8.81914559e+01 4.28646249e+00 -2.86837882e+00 7.17275182e+01
1716.lowfreq: -65.3338 -7.3511 -4.6402 0.0008 0.0015 0.0017 8.1299 37.5173 53.1100
frequency: -65.3010 37.4799 53.0859 64.9315 76.1315 142.0815 170.0815 232.7609 241.4655 284.1795 344.1801 368.0523 443.8210 470.3243 502.8116 509.8425 562.2892 587.4501 643.0225 673.6714 851.3285 880.8143 917.7625 940.4148 1009.0266 1014.5769 1066.1853 1095.9979 1121.6759 1145.7795 1206.7905 1236.2330 1261.7525 1321.5930 1357.1512 1372.6593 1395.0783 1426.3568 1446.1893 1449.8499 1474.4417 1480.5126 1632.8607 1662.8092 2988.9651 2995.5295 3010.4484 3056.4145 3071.3522 3086.3699 3089.3011 3096.1254 3124.3729 3511.7870
redmass: 1.0630 8.7466 6.8717 3.5182 3.4610 3.8583 5.0750 1.1573 4.9518 2.8189 3.1292 3.6413 4.0043 5.2459 3.0907 2.1966 4.9354 4.2435 1.3909 4.0561 4.2028 1.9725 1.9051 2.3448 1.7041 1.5743 1.8820 2.0299 2.4697 2.1483 1.2446 1.2466 1.6325 1.3881 1.8457 1.2224 1.2159 1.0863 1.0651 1.0471 1.0508 1.0434 8.9892 8.1786 1.0360 1.0356 1.0604 1.0896 1.0973 1.0975 1.0979 1.0996 1.1011 1.0640
irintensity: 1.2792 0.6477 0.3658 0.3869 2.8483 6.4854 3.4117 0.9577 1.4985 2.1498 3.6754 2.1123 11.3700 7.2722 2.2814 30.4301 32.0271 88.1122 126.3333 7.9873 1.3981 2.9126 16.4471 50.5503 168.9866 7.2984 142.3074 32.4686 146.7155 11.9082 2.2927 5.9052 3.3866 17.2502 86.2510 45.2424 27.7257 25.4795 28.6934 22.8173 9.9734 16.9949 173.1505 206.2818 19.9724 1.2839 10.4965 0.5669 0.7124 6.5368 17.7365 17.6439 10.5844 22.7674
temp: 298.150 k
press: 1.00000 atm
elementType: 16 8 8 8 6 6 6 6 6 6 1 1 1 1 1 1 1 1 1 1
symmnumber: 1
zpe: 401982.2 jmol-1
zpe.correction: 0.153107 hartree
zpe.thermalcorrener: 0.164707 hartree
zpe.thermalcorrenthalpy: 0.165652 hartree
zpe.thermalcorrgfe: 0.113993 hartree
zpe.sumelectzpe: -857.595273 hartree
zpe.sumelectthermal: -857.583672 hartree
zpe.sumelectthermalent: -857.582728 hartree
zpe.sumelectthermalfe: -857.634386 hartree
dipole: -1.0169 0.4383 -1.8133
dipole: 2.1247
quadrupole: -54.1196 -68.0453 -72.2930
quadrupole: -1.1045 -2.4941 1.9776
quadrupole: 10.6997 -3.2260 -7.4737 -1.1045 -2.4941 1.9776
hfenergy: -857.7483795 hartree
pointgroup: C01 [X(C6H10O3S1)]
dipole: -0.3334672 0.2580159 -0.7217953 debye
dipolederiv: -0.5868761 -0.2922686 0.038309 -0.4707855 -0.6133482 0.040246 0.0788184 0.0986389 -0.1425851 -0.8015218 0.3036517 0.4277467 0.3323692 -0.669204 -0.2982575 0.4042477 -0.2758512 -0.6106596 -0.6239375 0.062458 -0.2271188 0.2024141 -0.441329 -0.0970418 0.0077086 -0.2409586 -0.8896251 -0.5146071 0.2156749 -0.1810592 -0.2306639 -0.9760474 0.2787491 0.0460098 0.4268439 -0.4171043 0.6392253 0.0665427 0.0769081 -0.0135599 0.1171757 0.0685907 0.1582348 0.1170001 0.1243083 -0.3227852 0.0727572 -0.1253447 -0.0139248 -0.0208064 -0.0851617 -0.3473729 -0.0415657 -0.0896095 -0.1542009 -0.090867 -0.0455372 0.0541973 -0.0313688 -0.0351684 -0.0693545 -0.0994932 0.0522402 1.2233083 -0.4801713 0.0044 -0.5453885 0.6238391 0.3985188 -0.0808525 0.4641893 1.2544677 0.9981182 0.2115103 0.201921 0.8237308 1.4141121 -0.3799611 -0.0714945 -0.5791713 0.2841503 -0.4810109 -0.0714689 -0.1398646 -0.0921637 -0.0376402 -0.0003869 -0.1178905 0.0182396 -0.0035418 -0.0179542 -0.0417407 -0.0013377 0.0185461 0.0165748 0.0596125 0.0103123 -0.00077 -0.0190673 0.0653342 0.0276599 0.0306856 0.0071991 0.0674617 0.0860571 0.0625046 0.0364117 -0.0118564 0.1087605 -0.0475263 -0.0284855 -0.0035753 -0.0255001 -0.022954 -0.0234469 -0.0063296 0.0991325 -0.0776629 -0.0371615 -0.0803984 -0.0468458 0.1084953 0.026662 -0.0831607 0.0025935 0.0762928 0.1066246 -0.0065047 0.0196666 -0.0379764 0.0419198 0.0379957 0.0540545 0.1192742 -0.0960045 0.0394217 0.114179 0.0940482 0.0669015 -0.0062181 -0.0776287 0.0858494 -0.0671694 0.0338611 0.104938 -0.0232463 0.0395533 -0.0298782 0.1082507 0.0520833 -0.0054154 0.0320243 -0.0574797 0.061527 0.023386 0.024042 0.0546296 0.0072095 -0.0806106 0.0499434 -0.0721267 0.0853704 0.0228742 -0.0561495 -0.0166705 -0.1093042 -0.0487284 0.0302527 -0.0030628 0.0475058 0.1147987 0.2104246 0.0492852 -0.1114638 0.0340787 0.3651518 -0.0015972 -0.1556328 0.0207147 0.2129114 unknown
polarizability: 115.4825772|4.6443371|88.2382339|8.4347142|-0.9494503|72.4010026 unknown
InChI: InChI=1S/C6H10O3S/c1-4(3-6(8)9)10-5(2)7/h4,8H,3H2,1-2H3
charge 0 multiplicity 1
20 atoms
S  -1.514222 1.154345 -0.634602
O  3.12672 -1.214905 -0.9111
O  2.699505 -0.246588 1.154107
O  -1.728874 -1.362338 0.443474
C  0.194376 0.888509 0.190927
C  1.025255 -0.076356 -0.677017
C  0.834826 2.270652 0.385025
C  2.333144 -0.48057 -0.018567
C  -2.324659 -0.463427 -0.19039
C  -3.761069 -0.547715 -0.670867
H  -0.027199 0.411714 1.160539
H  1.246178 0.362722 -1.667135
H  0.458123 -1.008173 -0.861159
H  1.798297 2.152046 0.911148
H  1.021365 2.771882 -0.582481
H  0.190329 2.926012 0.995843
H  -3.819902 -0.359811 -1.75777
H  -4.377148 0.219639 -0.168067
H  -4.168303 -1.545781 -0.44519
H  3.962259 -1.499256 -0.449716
