program: Gaussian 09
title: 000257702
version: EM64L-G09RevD.01
frameworkgroup: C1[X(C16H14N2)]
method: RPBEPBE
basis: SDD
operation: Freq
keyword: #pfreq=noraman
keyword: PBEPBE/SDD
title: #p freq=noraman PBEPBE/SDD
converged: YES YES NO NO
title: Mulliken charges:
elementType: N N C C C C C C C C C C C C C C C C H H H H H H H H H H H H H H
charge: -0.478526 0.014629 0.007881 0.274113 0.200897 0.219403 0.333518 -0.553952 0.185985 -0.659541 0.213437 -0.497903 -0.830344 -0.492067 -0.391408 -0.376866 -0.253617 -0.215238 0.220448 0.234835 0.243003 0.301767 0.217866 0.229105 0.205902 0.246708 0.245924 0.238737 0.235006 0.232694 0.223886 0.223719
chargesum: 0.00000
title: Mulliken charges with hydrogens summed into heavy atoms:
elementType: N N C C C C C C C C C C C C C C C C
charge: -0.176759 0.014629 0.007881 0.274113 0.200897 0.219403 0.333518 -0.098669 0.185985 -0.416539 0.213437 -0.050932 -0.131810 -0.253330 -0.156402 -0.144172 -0.029731 0.008481
polarizability: 3.33798676e+02 -2.08257016e+00 1.88679283e+02 -7.61474205e-02 2.83573979e+00 8.52810400e+01
1716.lowfreq: -5.2434 -0.0006 0.0003 0.0006 4.5631 8.2016 57.3385 70.5327 89.4954
frequency: 57.2113 70.4588 89.4931 124.3970 140.1998 148.7136 214.1791 248.6217 263.5120 310.5159 334.3730 341.7965 361.3681 438.5711 456.3623 470.6954 487.4177 510.7823 526.8505 552.0809 575.2436 578.4225 611.4826 632.1216 666.6651 722.1569 744.5117 752.8811 760.0870 788.9951 798.1332 837.4234 856.1581 861.7883 885.4462 916.7742 921.0731 936.4094 942.2730 974.3034 1001.5375 1015.2506 1026.6743 1045.8738 1059.5689 1080.9714 1108.0640 1156.9328 1173.9967 1179.9348 1204.0510 1229.8688 1234.6184 1251.0666 1274.8433 1305.6009 1330.1052 1334.5781 1350.6059 1362.9996 1395.0437 1401.4167 1418.5882 1442.6196 1446.6922 1451.6966 1455.8508 1472.1877 1478.2530 1486.3993 1490.4802 1574.2108 1589.5281 1605.5158 1620.8566 1637.4243 2948.3429 2961.4583 2976.9646 3039.7648 3049.7822 3055.7500 3062.6785 3075.6455 3126.9793 3129.2554 3135.0364 3147.8430 3165.4307 3615.8994
redmass: 1.7183 1.6712 3.7987 2.9532 3.0976 4.9591 3.0928 3.4159 3.0336 4.7839 4.8149 3.9711 4.7972 2.9692 2.8222 5.6980 1.3284 2.6520 4.9747 4.1470 4.3589 3.8836 6.2759 4.4404 4.0280 3.6964 2.4765 1.5719 3.7064 3.3981 3.9763 4.8902 1.4520 3.1127 1.4557 3.1890 3.6534 1.3982 1.7241 1.3116 2.2241 2.0509 1.5426 3.1071 2.1207 2.1867 1.9101 1.9033 1.3456 1.2398 1.7141 1.4198 1.2854 2.5761 3.0024 1.3557 2.3815 2.3199 1.4189 1.8375 2.9232 1.3535 3.0593 2.8623 1.2361 2.2904 1.1751 1.2046 1.5737 3.9151 1.9481 7.5862 6.7568 7.6788 6.4637 7.9833 1.0690 1.0655 1.0380 1.0921 1.0948 1.0968 1.0899 1.0980 1.0853 1.0915 1.0894 1.0953 1.1002 1.0796
irintensity: 0.9959 0.0617 0.8382 0.3018 0.8013 0.1200 2.0771 0.3659 0.2505 0.5167 7.2889 0.7744 3.5261 9.9864 7.0710 0.5771 64.5841 33.8174 1.0772 2.2910 1.2473 1.3460 3.3739 5.8582 5.9922 3.0507 36.0782 78.4637 10.1220 15.3924 3.6646 8.2068 0.0146 6.7502 3.6793 2.6004 1.2648 5.8855 18.0346 0.0018 6.9157 8.9694 5.1316 6.8319 2.4218 5.5655 10.8958 26.1381 9.9474 1.2246 2.6201 7.0662 7.7218 78.9328 18.1502 13.6416 52.4980 38.9768 36.0555 18.9880 0.7273 11.6966 4.4347 13.7635 20.4275 14.2152 5.4573 8.1607 13.0852 71.2977 14.0587 69.9586 2.1369 36.0317 91.1594 7.5514 31.5408 51.0332 31.5971 42.0056 50.7384 15.9544 32.1842 24.1993 0.3149 7.8977 2.3215 30.8654 36.1678 45.2091
temp: 298.150 k
press: 1.00000 atm
elementType: 7 7 6 6 6 6 6 6 6 6 6 6 6 6 6 6 6 6 1 1 1 1 1 1 1 1 1 1 1 1 1 1
symmnumber: 1
zpe: 676456.4 jmol-1
zpe.correction: 0.257649 hartree
zpe.thermalcorrener: 0.271742 hartree
zpe.thermalcorrenthalpy: 0.272686 hartree
zpe.thermalcorrgfe: 0.216937 hartree
zpe.sumelectzpe: -726.390375 hartree
zpe.sumelectthermal: -726.376281 hartree
zpe.sumelectthermalent: -726.375337 hartree
zpe.sumelectthermalfe: -726.431087 hartree
dipole: 2.3279 4.2080 0.0555
dipole: 4.8093
quadrupole: -108.8203 -92.0252 -110.3331
quadrupole: -10.2005 0.0896 1.1155
quadrupole: -5.0941 11.7010 -6.6069 -10.2005 0.0896 1.1155
hfenergy: -726.6480233 hartree
pointgroup: C01 [X(C16H14N2)]
dipole: 0.9381399 -1.6430695 -0.0187173 debye
polarizability: 333.7115763|4.021807|188.7585578|1.0924038|2.9082685|85.2888649 unknown
InChI: InChI=1S/C16H14N2/c1-10-12-6-7-17-9-11(12)8-14-13-4-2-3-5-15(13)18-16(10)14/h2-5,8-9,18H,6-7H2,1H3
charge 0 multiplicity 1
32 atoms
N  1.448371 -1.643288 -0.032329
N  -4.25769 1.555581 -0.117543
C  0.2306 -0.943947 0.016938
C  -2.140883 -0.508872 0.084451
C  0.5267 0.46456 0.0448
C  -1.092303 -1.458452 0.048399
C  -1.864683 0.902251 0.105924
C  -3.608509 -0.9079 0.185726
C  1.9793 0.599237 0.013697
C  -0.536503 1.386728 0.097673
C  2.520491 -0.731696 -0.034833
C  -4.531504 0.135613 -0.490171
C  -1.362817 -2.954199 0.051412
C  -3.003381 1.84428 0.140252
C  2.861256 1.704743 0.020635
C  3.908578 -0.976031 -0.076306
C  4.252483 1.470515 -0.020232
C  4.768044 0.144744 -0.068139
H  -3.792506 -1.902831 -0.258732
H  -3.881773 -0.985229 1.260568
H  -0.349581 2.466773 0.122867
H  1.545053 -2.654769 -0.06838
H  -4.433945 0.065933 -1.595292
H  -5.588104 -0.075025 -0.248009
H  -0.441123 -3.547835 0.1811
H  -2.045822 -3.23943 0.871684
H  -1.834048 -3.284261 -0.894144
H  -2.779928 2.897596 0.374336
H  2.473484 2.728816 0.056538
H  4.31317 -1.993373 -0.112937
H  4.947405 2.31704 -0.015367
H  5.852368 -0.009671 -0.099186
